BDBM50309285 2-(2-benzhydryl-4-(3-fluorophenyl)thiazol-5-yl)acetic acid::CHEMBL596932
SMILES: OC(=O)Cc1sc(nc1-c1cccc(F)c1)C(c1ccccc1)c1ccccc1
InChI Key: InChIKey=PVJXZPBQSMAWDT-UHFFFAOYSA-N
Data: 2 IC50
Activity Spreadsheet -- Enzyme Inhibition Constant Data from BindingDB
Found 2 hits for monomerid = 50309285
Trg + Lig
Ki
nM
ΔG°
kcal/mole
IC50
nM
Kd
nM
EC50/IC50
nM
koff
s-1
kon
M-1s-1
pHTemp
°C
G protein-coupled receptor 44
(Homo sapiens (Human))
BDBM50309285
(2-(2-benzhydryl-4-(3-fluorophenyl)thiazol-5-yl)ace...)
Show SMILES OC(=O)Cc1sc(nc1-c1cccc(F)c1)C(c1ccccc1)c1ccccc1
Show InChI InChI=1S/C24H18FNO2S/c25-19-13-7-12-18(14-19)23-20(15-21(27)28)29-24(26-23)22(16-8-3-1-4-9-16)17-10-5-2-6-11-17/h1-14,22H,15H2,(H,27,28)
Reactome pathway
n/an/a 2.90n/an/an/an/an/an/a
7TM Pharma A/S
Curated by ChEMBL
Assay Description
Displacement of[3H]PGD2 from human CRTH2 receptor expressed in HEK385-7 cells
Bioorg Med Chem Lett 20: 1181-5 (2010)
Article DOI: 10.1016/j.bmcl.2009.12.015
BindingDB Entry DOI: 10.7270/Q2PR7W35
G protein-coupled receptor 44
(Homo sapiens (Human))
BDBM50309285
(2-(2-benzhydryl-4-(3-fluorophenyl)thiazol-5-yl)ace...)
Show SMILES OC(=O)Cc1sc(nc1-c1cccc(F)c1)C(c1ccccc1)c1ccccc1
Show InChI InChI=1S/C24H18FNO2S/c25-19-13-7-12-18(14-19)23-20(15-21(27)28)29-24(26-23)22(16-8-3-1-4-9-16)17-10-5-2-6-11-17/h1-14,22H,15H2,(H,27,28)
Reactome pathway
n/an/a 29n/an/an/an/an/an/a
7TM Pharma A/S
Curated by ChEMBL
Assay Description
Antagonist activity at human CRTH2 receptor expressed in HEK285-7 cells assessed as inhibition of beta arrestin translocation by bioluminescence reso...
Bioorg Med Chem Lett 20: 1181-5 (2010)
Article DOI: 10.1016/j.bmcl.2009.12.015
BindingDB Entry DOI: 10.7270/Q2PR7W35