BDBM50309364 6,7-dichloro-4-(4-fluoro-3-(4-(pyridin-2-yl)piperazine-1-carbonyl)benzyl)pyrrolo[1,2-a]pyrazin-1(2H)-one::CHEMBL604040
SMILES: Fc1ccc(Cc2c[nH]c(=O)c3cc(Cl)c(Cl)n23)cc1C(=O)N1CCN(CC1)c1ccccn1
InChI Key: InChIKey=HFJVTAHWORYIOK-UHFFFAOYSA-N
Data: 1 IC50
Activity Spreadsheet -- Enzyme Inhibition Constant Data from BindingDB
Found 1 hit for monomerid = 50309364
Trg + Lig
Ki
nM
ΔG°
kcal/mole
IC50
nM
Kd
nM
EC50/IC50
nM
koff
s-1
kon
M-1s-1
pHTemp
°C
Poly [ADP-ribose] polymerase 1
(Homo sapiens (Human))
BDBM50309364
(6,7-dichloro-4-(4-fluoro-3-(4-(pyridin-2-yl)pipera...)
Show SMILES Fc1ccc(Cc2c[nH]c(=O)c3cc(Cl)c(Cl)n23)cc1C(=O)N1CCN(CC1)c1ccccn1
Show InChI InChI=1S/C24H20Cl2FN5O2/c25-18-13-20-23(33)29-14-16(32(20)22(18)26)11-15-4-5-19(27)17(12-15)24(34)31-9-7-30(8-10-31)21-3-1-2-6-28-21/h1-6,12-14H,7-11H2,(H,29,33)
n/an/a 2.80n/an/an/an/an/an/a
IRBM/Merck Research Laboratories
Curated by ChEMBL
Assay Description
Inhibition of PARP1 by topcount microplate scintillation counter
Bioorg Med Chem Lett 20: 1094-9 (2010)
Article DOI: 10.1016/j.bmcl.2009.12.026
BindingDB Entry DOI: 10.7270/Q2FB531P