BDBM50309757 CHEMBL596877::pyridin-3-yl 4-butoxybenzylcarbamate
SMILES: CCCCOc1ccc(CNC(=O)Oc2cccnc2)cc1
InChI Key: InChIKey=CZFYUEMAFQHRFG-UHFFFAOYSA-N
Data: 1 IC50
Activity Spreadsheet -- Enzyme Inhibition Constant Data from BindingDB
Found 1 hit for monomerid = 50309757
Trg + Lig
Ki
nM
ΔG°
kcal/mole
IC50
nM
Kd
nM
EC50/IC50
nM
koff
s-1
kon
M-1s-1
pHTemp
°C
Fatty-acid amide hydrolase 1
(Homo sapiens (Human))
BDBM50309757
(CHEMBL596877 | pyridin-3-yl 4-butoxybenzylcarbamat...)
Show SMILES CCCCOc1ccc(CNC(=O)Oc2cccnc2)cc1
Show InChI InChI=1S/C17H20N2O3/c1-2-3-11-21-15-8-6-14(7-9-15)12-19-17(20)22-16-5-4-10-18-13-16/h4-10,13H,2-3,11-12H2,1H3,(H,19,20)
n/an/a 6.10n/an/an/an/an/an/a
Bristol-Myers Squibb Research& Development
Curated by ChEMBL
Assay Description
Inhibition of human FAAH expressed in human H4 cells
Bioorg Med Chem Lett 20: 1272-7 (2010)
Article DOI: 10.1016/j.bmcl.2009.11.080
BindingDB Entry DOI: 10.7270/Q2H41RKR