BDBM50309980 4-((1H-1,2,4-Triazol-1-yl)methyl)-5-(4-chlorophenyl)-1-(2,4-dichlorophenyl)-N-(1-(2,4-dichlorophenyl)ethyl)-1Hpyrazole-3-carboxamide::CHEMBL598028
SMILES: Cc1cc(Cl)cc(Cl)c1CNC(=O)c1nn(c(c1Cn1cncn1)-c1ccc(Cl)cc1)-c1ccc(Cl)cc1Cl
InChI Key: InChIKey=BJCKMVKOTDNCFH-UHFFFAOYSA-N
Data: 1 IC50
Activity Spreadsheet -- Enzyme Inhibition Constant Data from BindingDB
Found 1 hit for monomerid = 50309980
Trg + Lig
Ki
nM
ΔG°
kcal/mole
IC50
nM
Kd
nM
EC50/IC50
nM
koff
s-1
kon
M-1s-1
pHTemp
°C
Cannabinoid receptor 1
(Rattus norvegicus (rat))
BDBM50309980
(4-((1H-1,2,4-Triazol-1-yl)methyl)-5-(4-chloropheny...)
Show SMILES Cc1cc(Cl)cc(Cl)c1CNC(=O)c1nn(c(c1Cn1cncn1)-c1ccc(Cl)cc1)-c1ccc(Cl)cc1Cl
Show InChI InChI=1S/C27H19Cl5N6O/c1-15-8-19(30)10-22(31)20(15)11-34-27(39)25-21(12-37-14-33-13-35-37)26(16-2-4-17(28)5-3-16)38(36-25)24-7-6-18(29)9-23(24)32/h2-10,13-14H,11-12H2,1H3,(H,34,39)
Reactome pathway
n/an/a 2.60n/an/an/an/an/an/a
Green Cross Corporation
Curated by ChEMBL
Assay Description
Displacement of [3H]CP55,940 from CB1 receptor in Sprague-Dawley rat cerebellar membrane
Bioorg Med Chem 18: 1149-62 (2010)
Article DOI: 10.1016/j.bmc.2009.12.040
BindingDB Entry DOI: 10.7270/Q2TD9XG2