BDBM50309989 4-((1H-1,2,4-Triazol-1-yl)methyl)-1-(2-chlorophenyl)-5-(4-chlorophenyl)-N-(1-(2,4-dichlorophenyl)ethyl)-1H-pyrazole-3-carboxamide::CHEMBL597317
SMILES: Cc1cc(Cl)cc(Cl)c1CNC(=O)c1nn(c(c1Cn1cncn1)-c1ccc(Cl)cc1)-c1ccccc1Cl
InChI Key: InChIKey=DUQNACHXFYOVEQ-UHFFFAOYSA-N
Data: 2 IC50
Activity Spreadsheet -- Enzyme Inhibition Constant Data from BindingDB
Found 2 hits for monomerid = 50309989
Trg + Lig
Ki
nM
ΔG°
kcal/mole
IC50
nM
Kd
nM
EC50/IC50
nM
koff
s-1
kon
M-1s-1
pHTemp
°C
Cannabinoid receptor 2
(Homo sapiens (Human))
BDBM50309989
(4-((1H-1,2,4-Triazol-1-yl)methyl)-1-(2-chloropheny...)
Show SMILES Cc1cc(Cl)cc(Cl)c1CNC(=O)c1nn(c(c1Cn1cncn1)-c1ccc(Cl)cc1)-c1ccccc1Cl
Show InChI InChI=1S/C27H20Cl4N6O/c1-16-10-19(29)11-23(31)20(16)12-33-27(38)25-21(13-36-15-32-14-34-36)26(17-6-8-18(28)9-7-17)37(35-25)24-5-3-2-4-22(24)30/h2-11,14-15H,12-13H2,1H3,(H,33,38)
Reactome pathway
n/an/a 3.33E+3n/an/an/an/an/an/a
Green Cross Corporation
Curated by ChEMBL
Assay Description
Displacement of [3H]WIN55,212-2 from human recombinant CB2 receptor expressed in CHO-K1 cell membrane
Bioorg Med Chem 18: 1149-62 (2010)
Article DOI: 10.1016/j.bmc.2009.12.040
BindingDB Entry DOI: 10.7270/Q2TD9XG2
Cannabinoid receptor 1
(Rattus norvegicus (rat))
BDBM50309989
(4-((1H-1,2,4-Triazol-1-yl)methyl)-1-(2-chloropheny...)
Show SMILES Cc1cc(Cl)cc(Cl)c1CNC(=O)c1nn(c(c1Cn1cncn1)-c1ccc(Cl)cc1)-c1ccccc1Cl
Show InChI InChI=1S/C27H20Cl4N6O/c1-16-10-19(29)11-23(31)20(16)12-33-27(38)25-21(13-36-15-32-14-34-36)26(17-6-8-18(28)9-7-17)37(35-25)24-5-3-2-4-22(24)30/h2-11,14-15H,12-13H2,1H3,(H,33,38)
Reactome pathway
n/an/a 2n/an/an/an/an/an/a
Green Cross Corporation
Curated by ChEMBL
Assay Description
Displacement of [3H]CP55,940 from CB1 receptor in Sprague-Dawley rat cerebellar membrane
Bioorg Med Chem 18: 1149-62 (2010)
Article DOI: 10.1016/j.bmc.2009.12.040
BindingDB Entry DOI: 10.7270/Q2TD9XG2