BDBM50309997 4-((1H-1,2,4-Triazol-1-yl)methyl)-5-(4-bromophenyl)-1-(2,4-dichlorophenyl)-N-(1-phenylcyclopropyl)-1H-pyrazole-3-carboxamide::CHEMBL603449
SMILES: Clc1ccc(c(Cl)c1)-n1nc(C(=O)NC2(CC2)c2ccccc2)c(Cn2cncn2)c1-c1ccc(Br)cc1
InChI Key: InChIKey=ZZRWRWUYMKSUNS-UHFFFAOYSA-N
Data: 1 IC50
Activity Spreadsheet -- Enzyme Inhibition Constant Data from BindingDB
Found 1 hit for monomerid = 50309997
Trg + Lig
Ki
nM
ΔG°
kcal/mole
IC50
nM
Kd
nM
EC50/IC50
nM
koff
s-1
kon
M-1s-1
pHTemp
°C
Cannabinoid receptor 1
(Rattus norvegicus (rat))
BDBM50309997
(4-((1H-1,2,4-Triazol-1-yl)methyl)-5-(4-bromophenyl...)
Show SMILES Clc1ccc(c(Cl)c1)-n1nc(C(=O)NC2(CC2)c2ccccc2)c(Cn2cncn2)c1-c1ccc(Br)cc1
Show InChI InChI=1S/C28H21BrCl2N6O/c29-20-8-6-18(7-9-20)26-22(15-36-17-32-16-33-36)25(35-37(26)24-11-10-21(30)14-23(24)31)27(38)34-28(12-13-28)19-4-2-1-3-5-19/h1-11,14,16-17H,12-13,15H2,(H,34,38)
Reactome pathway
n/an/a 7.86n/an/an/an/an/an/a
Green Cross Corporation
Curated by ChEMBL
Assay Description
Displacement of [3H]CP55,940 from CB1 receptor in Sprague-Dawley rat cerebellar membrane
Bioorg Med Chem 18: 1149-62 (2010)
Article DOI: 10.1016/j.bmc.2009.12.040
BindingDB Entry DOI: 10.7270/Q2TD9XG2