BDBM50310013 (4-((1H-1,2,4-Triazol-1-yl)methyl)-5-(4-bromophenyl)-1-(2,4-dichlorophenyl)-1H-pyrazol-3-yl)(4-(2,3-dimethylphenyl)piperazin-1-yl)methanone::CHEMBL592254
SMILES: Cc1cccc(N2CCN(CC2)C(=O)c2nn(c(c2Cn2cncn2)-c2ccc(Br)cc2)-c2ccc(Cl)cc2Cl)c1C
InChI Key: InChIKey=QSHXMEXBVNBLOB-UHFFFAOYSA-N
Data: 1 IC50
Activity Spreadsheet -- Enzyme Inhibition Constant Data from BindingDB
Found 1 hit for monomerid = 50310013
Trg + Lig
Ki
nM
ΔG°
kcal/mole
IC50
nM
Kd
nM
EC50/IC50
nM
koff
s-1
kon
M-1s-1
pHTemp
°C
Cannabinoid receptor 1
(Rattus norvegicus (rat))
BDBM50310013
((4-((1H-1,2,4-Triazol-1-yl)methyl)-5-(4-bromopheny...)
Show SMILES Cc1cccc(N2CCN(CC2)C(=O)c2nn(c(c2Cn2cncn2)-c2ccc(Br)cc2)-c2ccc(Cl)cc2Cl)c1C
Show InChI InChI=1S/C31H28BrCl2N7O/c1-20-4-3-5-27(21(20)2)38-12-14-39(15-13-38)31(42)29-25(17-40-19-35-18-36-40)30(22-6-8-23(32)9-7-22)41(37-29)28-11-10-24(33)16-26(28)34/h3-11,16,18-19H,12-15,17H2,1-2H3
Reactome pathway
n/an/a 3.80n/an/an/an/an/an/a
Green Cross Corporation
Curated by ChEMBL
Assay Description
Displacement of [3H]CP55,940 from CB1 receptor in Sprague-Dawley rat cerebellar membrane
Bioorg Med Chem 18: 1149-62 (2010)
Article DOI: 10.1016/j.bmc.2009.12.040
BindingDB Entry DOI: 10.7270/Q2TD9XG2