BDBM50310045 4-((1H-1,2,4-Triazol-1-yl)methyl)-5-(4-chlorophenyl)-1-(2,4-dichlorophenyl)-N-(2-phenylpropan-2-yl)-1H-pyrazole-3-carboxamide::CHEMBL597894
SMILES: Cc1cccc(C)c1CNC(=O)c1nn(c(c1Cn1cncn1)-c1ccc(Cl)cc1)-c1ccc(Cl)cc1Cl
InChI Key: InChIKey=BWHTYBPCFBJHPU-UHFFFAOYSA-N
Data: 1 IC50
Activity Spreadsheet -- Enzyme Inhibition Constant Data from BindingDB
Found 1 hit for monomerid = 50310045
Trg + Lig
Ki
nM
ΔG°
kcal/mole
IC50
nM
Kd
nM
EC50/IC50
nM
koff
s-1
kon
M-1s-1
pHTemp
°C
Cannabinoid receptor 1
(Rattus norvegicus (rat))
BDBM50310045
(4-((1H-1,2,4-Triazol-1-yl)methyl)-5-(4-chloropheny...)
Show SMILES Cc1cccc(C)c1CNC(=O)c1nn(c(c1Cn1cncn1)-c1ccc(Cl)cc1)-c1ccc(Cl)cc1Cl
Show InChI InChI=1S/C28H23Cl3N6O/c1-17-4-3-5-18(2)22(17)13-33-28(38)26-23(14-36-16-32-15-34-36)27(19-6-8-20(29)9-7-19)37(35-26)25-11-10-21(30)12-24(25)31/h3-12,15-16H,13-14H2,1-2H3,(H,33,38)
Reactome pathway
n/an/a 7.40n/an/an/an/an/an/a
Green Cross Corporation
Curated by ChEMBL
Assay Description
Displacement of [3H]CP55,940 from CB1 receptor in Sprague-Dawley rat cerebellar membrane
Bioorg Med Chem 18: 1149-62 (2010)
Article DOI: 10.1016/j.bmc.2009.12.040
BindingDB Entry DOI: 10.7270/Q2TD9XG2