BDBM50310055 4-((1H-1,2,4-Triazol-1-yl)methyl)-1-(2-chlorophenyl)-5-(4-chlorophenyl)-N-(3,3-dimethylbutan-2-yl)-1H-pyrazole-3-carboxamide::CHEMBL598958
SMILES: CC(NC(=O)c1nn(c(c1Cn1cncn1)-c1ccc(Cl)cc1)-c1ccccc1Cl)C(C)(C)C
InChI Key: InChIKey=YXWMDLNFPYAKTI-UHFFFAOYSA-N
Data: 1 IC50
Activity Spreadsheet -- Enzyme Inhibition Constant Data from BindingDB
Found 1 hit for monomerid = 50310055
Trg + Lig
Ki
nM
ΔG°
kcal/mole
IC50
nM
Kd
nM
EC50/IC50
nM
koff
s-1
kon
M-1s-1
pHTemp
°C
Cannabinoid receptor 1
(Rattus norvegicus (rat))
BDBM50310055
(4-((1H-1,2,4-Triazol-1-yl)methyl)-1-(2-chloropheny...)
Show SMILES CC(NC(=O)c1nn(c(c1Cn1cncn1)-c1ccc(Cl)cc1)-c1ccccc1Cl)C(C)(C)C
Show InChI InChI=1S/C25H26Cl2N6O/c1-16(25(2,3)4)30-24(34)22-19(13-32-15-28-14-29-32)23(17-9-11-18(26)12-10-17)33(31-22)21-8-6-5-7-20(21)27/h5-12,14-16H,13H2,1-4H3,(H,30,34)
Reactome pathway
n/an/a 6.22n/an/an/an/an/an/a
Green Cross Corporation
Curated by ChEMBL
Assay Description
Displacement of [3H]CP55,940 from CB1 receptor in Sprague-Dawley rat cerebellar membrane
Bioorg Med Chem 18: 1149-62 (2010)
Article DOI: 10.1016/j.bmc.2009.12.040
BindingDB Entry DOI: 10.7270/Q2TD9XG2