BDBM50310064 4-((1H-1,2,4-Triazol-1-yl)methyl)-5-(4-chlorophenyl)-1-(2,4-dichlorophenyl)-N'-(1-(trifluoromethyl)cyclopropanecarbonyl)-1H-pyrazole-3-carbohydrazide::CHEMBL591304
SMILES: FC(F)(F)C1(CC1)C(=O)NNC(=O)c1nn(c(c1Cn1cncn1)-c1ccc(Cl)cc1)-c1ccc(Cl)cc1Cl
InChI Key: InChIKey=IGGZZGUWEXYLBM-UHFFFAOYSA-N
Data: 1 IC50
Activity Spreadsheet -- Enzyme Inhibition Constant Data from BindingDB
Found 1 hit for monomerid = 50310064
Trg + Lig
Ki
nM
ΔG°
kcal/mole
IC50
nM
Kd
nM
EC50/IC50
nM
koff
s-1
kon
M-1s-1
pHTemp
°C
Cannabinoid receptor 1
(Rattus norvegicus (rat))
BDBM50310064
(4-((1H-1,2,4-Triazol-1-yl)methyl)-5-(4-chloropheny...)
Show SMILES FC(F)(F)C1(CC1)C(=O)NNC(=O)c1nn(c(c1Cn1cncn1)-c1ccc(Cl)cc1)-c1ccc(Cl)cc1Cl
Show InChI InChI=1S/C24H17Cl3F3N7O2/c25-14-3-1-13(2-4-14)20-16(10-36-12-31-11-32-36)19(35-37(20)18-6-5-15(26)9-17(18)27)21(38)33-34-22(39)23(7-8-23)24(28,29)30/h1-6,9,11-12H,7-8,10H2,(H,33,38)(H,34,39)
Reactome pathway
n/an/a 126n/an/an/an/an/an/a
Green Cross Corporation
Curated by ChEMBL
Assay Description
Displacement of [3H]CP55,940 from CB1 receptor in Sprague-Dawley rat cerebellar membrane
Bioorg Med Chem 18: 1149-62 (2010)
Article DOI: 10.1016/j.bmc.2009.12.040
BindingDB Entry DOI: 10.7270/Q2TD9XG2