BDBM50310402 (S)-5-[4-(2-Piperidin-1-yl-ethoxy)-phenyl]-11,12-dihydro-5H-6,13-dioxa-benzo[3,4]cyclohepta[1,2-a]naphthalen-8-ol::CHEMBL1086652
SMILES: Oc1ccc2C3=C([C@@H](Oc2c1)c1ccc(OCCN2CCCCC2)cc1)c1ccccc1OCC3
InChI Key: InChIKey=IRZRURKICLRQNH-PMERELPUSA-N
Data: 4 IC50
Activity Spreadsheet -- Enzyme Inhibition Constant Data from BindingDB
Found 4 hits for monomerid = 50310402
Trg + Lig
Ki
nM
ΔG°
kcal/mole
IC50
nM
Kd
nM
EC50/IC50
nM
koff
s-1
kon
M-1s-1
pHTemp
°C
Estradiol receptor beta (ERβ)
(Homo sapiens (Human))
BDBM50310402
((S)-5-[4-(2-Piperidin-1-yl-ethoxy)-phenyl]-11,12-d...)
Show SMILES Oc1ccc2C3=C([C@@H](Oc2c1)c1ccc(OCCN2CCCCC2)cc1)c1ccccc1OCC3 |r,c:5|
Show InChI InChI=1S/C30H31NO4/c32-22-10-13-24-25-14-18-34-27-7-3-2-6-26(27)29(25)30(35-28(24)20-22)21-8-11-23(12-9-21)33-19-17-31-15-4-1-5-16-31/h2-3,6-13,20,30,32H,1,4-5,14-19H2/t30-/m0/s1
n/an/a 63n/an/an/an/an/an/a
Johnson& Johnson Pharmaceutical Research& Development LLC
Curated by ChEMBL
Assay Description
Inhibition of fluormone ES2 binding to estrogen receptor beta after 1 hr by fluorescence polarization assay
J Med Chem 52: 7544-69 (2009)
Article DOI: 10.1021/jm900146e
BindingDB Entry DOI: 10.7270/Q27D2V8M
Estrogen receptor
(Homo sapiens (Human))
BDBM50310402
((S)-5-[4-(2-Piperidin-1-yl-ethoxy)-phenyl]-11,12-d...)
Show SMILES Oc1ccc2C3=C([C@@H](Oc2c1)c1ccc(OCCN2CCCCC2)cc1)c1ccccc1OCC3 |r,c:5|
Show InChI InChI=1S/C30H31NO4/c32-22-10-13-24-25-14-18-34-27-7-3-2-6-26(27)29(25)30(35-28(24)20-22)21-8-11-23(12-9-21)33-19-17-31-15-4-1-5-16-31/h2-3,6-13,20,30,32H,1,4-5,14-19H2/t30-/m0/s1
n/an/a 6.30n/an/an/an/an/an/a
Johnson& Johnson Pharmaceutical Research& Development LLC
Curated by ChEMBL
Assay Description
Displacement of radiolabeled estrogen from estrogen receptor alpha by scintillation counting
J Med Chem 52: 7544-69 (2009)
Article DOI: 10.1021/jm900146e
BindingDB Entry DOI: 10.7270/Q27D2V8M
Estrogen receptor
(Homo sapiens (Human))
BDBM50310402
((S)-5-[4-(2-Piperidin-1-yl-ethoxy)-phenyl]-11,12-d...)
Show SMILES Oc1ccc2C3=C([C@@H](Oc2c1)c1ccc(OCCN2CCCCC2)cc1)c1ccccc1OCC3 |r,c:5|
Show InChI InChI=1S/C30H31NO4/c32-22-10-13-24-25-14-18-34-27-7-3-2-6-26(27)29(25)30(35-28(24)20-22)21-8-11-23(12-9-21)33-19-17-31-15-4-1-5-16-31/h2-3,6-13,20,30,32H,1,4-5,14-19H2/t30-/m0/s1
n/an/a 150n/an/an/an/an/an/a
Johnson& Johnson Pharmaceutical Research& Development LLC
Curated by ChEMBL
Assay Description
Antagonist activity at estrogen receptor in human MCF7 cells assessed as 17beta-estradiol-induced cell proliferation after 24 hrs by [14C]thymidine i...
J Med Chem 52: 7544-69 (2009)
Article DOI: 10.1021/jm900146e
BindingDB Entry DOI: 10.7270/Q27D2V8M
Estrogen receptor
(Homo sapiens (Human))
BDBM50310402
((S)-5-[4-(2-Piperidin-1-yl-ethoxy)-phenyl]-11,12-d...)
Show SMILES Oc1ccc2C3=C([C@@H](Oc2c1)c1ccc(OCCN2CCCCC2)cc1)c1ccccc1OCC3 |r,c:5|
Show InChI InChI=1S/C30H31NO4/c32-22-10-13-24-25-14-18-34-27-7-3-2-6-26(27)29(25)30(35-28(24)20-22)21-8-11-23(12-9-21)33-19-17-31-15-4-1-5-16-31/h2-3,6-13,20,30,32H,1,4-5,14-19H2/t30-/m0/s1
n/an/a 25.9n/an/an/an/an/an/a
Johnson& Johnson Pharmaceutical Research& Development LLC
Curated by ChEMBL
Assay Description
Antagonist activity at estrogen receptor in human Ishikawa cells assessed as 17beta-estradiol-induced alkaline phosphatase activity after 3 days by c...
J Med Chem 52: 7544-69 (2009)
Article DOI: 10.1021/jm900146e
BindingDB Entry DOI: 10.7270/Q27D2V8M