BDBM50310641 4-(3-(5-tert-butylisoxazol-3-yl)ureido)-N-(pyridin-2-yl)benzamide::CHEMBL1079354
SMILES: CC(C)(C)c1cc(NC(=O)Nc2ccc(cc2)C(=O)Nc2ccccn2)no1
InChI Key: InChIKey=PFDQUEBOFMXKRP-UHFFFAOYSA-N
Data: 1 Kd
Activity Spreadsheet -- Enzyme Inhibition Constant Data from BindingDB
Found 1 hit for monomerid = 50310641
Trg + Lig
Ki
nM
ΔG°
kcal/mole
IC50
nM
Kd
nM
EC50/IC50
nM
koff
s-1
kon
M-1s-1
pHTemp
°C
Receptor-type tyrosine-protein kinase FLT3
(Homo sapiens (Human))
BDBM50310641
(4-(3-(5-tert-butylisoxazol-3-yl)ureido)-N-(pyridin...)
Show SMILES CC(C)(C)c1cc(NC(=O)Nc2ccc(cc2)C(=O)Nc2ccccn2)no1
Show InChI InChI=1S/C20H21N5O3/c1-20(2,3)15-12-17(25-28-15)24-19(27)22-14-9-7-13(8-10-14)18(26)23-16-6-4-5-11-21-16/h4-12H,1-3H3,(H,21,23,26)(H2,22,24,25,27)
n/an/an/a 8.15n/an/an/an/an/a
Ambit Biosciences Inc.
Curated by ChEMBL
Assay Description
Binding affinity to FLT3
Bioorg Med Chem Lett 19: 5182-5 (2009)
Article DOI: 10.1016/j.bmcl.2009.07.024
BindingDB Entry DOI: 10.7270/Q2PG1RVB