BDBM50310654 (S)-3-fluoro-N-isobutyl-N-(pyrrolidin-3-yl)-2-(trifluoromethyl)benzamide::CHEMBL1078074
SMILES: CC(C)CN([C@H]1CCNC1)C(=O)c1cccc(F)c1C(F)(F)F
InChI Key: InChIKey=JEEXCFPOFSQJAA-NSHDSACASA-N
Data: 2 KI  1 IC50
Activity Spreadsheet -- Enzyme Inhibition Constant Data from BindingDB
Found 3 hits for monomerid = 50310654
Trg + Lig
Ki
nM
ΔG°
kcal/mole
IC50
nM
Kd
nM
EC50/IC50
nM
koff
s-1
kon
M-1s-1
pHTemp
°C
Sodium-dependent serotonin transporter
(Homo sapiens (Human))
BDBM50310654
((S)-3-fluoro-N-isobutyl-N-(pyrrolidin-3-yl)-2-(tri...)
Show SMILES CC(C)CN([C@H]1CCNC1)C(=O)c1cccc(F)c1C(F)(F)F |r|
Show InChI InChI=1S/C16H20F4N2O/c1-10(2)9-22(11-6-7-21-8-11)15(23)12-4-3-5-13(17)14(12)16(18,19)20/h3-5,10-11,21H,6-9H2,1-2H3/t11-/m0/s1
25n/an/an/an/an/an/an/an/a
Pfizer Global Research and Development
Curated by ChEMBL
Assay Description
Displacement of [3H]5HT from human 5HT transporter expressed in HEK293 cells by scintillation counting
Bioorg Med Chem Lett 19: 5078-81 (2009)
Article DOI: 10.1016/j.bmcl.2009.07.049
BindingDB Entry DOI: 10.7270/Q2JQ115V
Sodium-dependent noradrenaline transporter
(Homo sapiens (Human))
BDBM50310654
((S)-3-fluoro-N-isobutyl-N-(pyrrolidin-3-yl)-2-(tri...)
Show SMILES CC(C)CN([C@H]1CCNC1)C(=O)c1cccc(F)c1C(F)(F)F |r|
Show InChI InChI=1S/C16H20F4N2O/c1-10(2)9-22(11-6-7-21-8-11)15(23)12-4-3-5-13(17)14(12)16(18,19)20/h3-5,10-11,21H,6-9H2,1-2H3/t11-/m0/s1
Reactome pathway
26n/an/an/an/an/an/an/an/a
Pfizer Global Research and Development
Curated by ChEMBL
Assay Description
Displacement of [3H]noradrenaline from human NET receptor expressed in HEK293 cells by scintillation counting
Bioorg Med Chem Lett 19: 5078-81 (2009)
Article DOI: 10.1016/j.bmcl.2009.07.049
BindingDB Entry DOI: 10.7270/Q2JQ115V
Potassium voltage-gated channel subfamily H member 2
(Homo sapiens (Human))
BDBM50310654
((S)-3-fluoro-N-isobutyl-N-(pyrrolidin-3-yl)-2-(tri...)
Show SMILES CC(C)CN([C@H]1CCNC1)C(=O)c1cccc(F)c1C(F)(F)F |r|
Show InChI InChI=1S/C16H20F4N2O/c1-10(2)9-22(11-6-7-21-8-11)15(23)12-4-3-5-13(17)14(12)16(18,19)20/h3-5,10-11,21H,6-9H2,1-2H3/t11-/m0/s1
Reactome pathway
n/an/a>1.00E+4n/an/an/an/an/an/a
Pfizer Global Research and Development
Curated by ChEMBL
Assay Description
Inhibition of human ERG
Bioorg Med Chem Lett 19: 5078-81 (2009)
Article DOI: 10.1016/j.bmcl.2009.07.049
BindingDB Entry DOI: 10.7270/Q2JQ115V