BDBM50310794 CHEMBL1080973::N-(2,4-dichlorobenzyl)-3-methyl-3-phenylpiperidine-1-carboxamide
SMILES: CC1(CCCN(C1)C(=O)NCc1ccc(Cl)cc1Cl)c1ccccc1
InChI Key: InChIKey=MBEXSEUYYAPDIQ-UHFFFAOYSA-N
Data: 2 IC50
Activity Spreadsheet -- Enzyme Inhibition Constant Data from BindingDB
Found 2 hits for monomerid = 50310794
Trg + Lig
Ki
nM
ΔG°
kcal/mole
IC50
nM
Kd
nM
EC50/IC50
nM
koff
s-1
kon
M-1s-1
pHTemp
°C
Cytochrome P450 2C9
(Homo sapiens (Human))
BDBM50310794
(CHEMBL1080973 | N-(2,4-dichlorobenzyl)-3-methyl-3-...)
Show SMILES CC1(CCCN(C1)C(=O)NCc1ccc(Cl)cc1Cl)c1ccccc1
Show InChI InChI=1S/C20H22Cl2N2O/c1-20(16-6-3-2-4-7-16)10-5-11-24(14-20)19(25)23-13-15-8-9-17(21)12-18(15)22/h2-4,6-9,12H,5,10-11,13-14H2,1H3,(H,23,25)
Reactome pathway
n/an/a>1.00E+4n/an/an/an/an/an/a
Merck Research Laboratories
Curated by ChEMBL
Assay Description
Inhibition of CYP2C9
Bioorg Med Chem Lett 19: 5314-20 (2009)
Article DOI: 10.1016/j.bmcl.2009.07.138
BindingDB Entry DOI: 10.7270/Q2S75GFP
Epoxide hydrolase 2
(Rattus norvegicus)
BDBM50310794
(CHEMBL1080973 | N-(2,4-dichlorobenzyl)-3-methyl-3-...)
Show SMILES CC1(CCCN(C1)C(=O)NCc1ccc(Cl)cc1Cl)c1ccccc1
Show InChI InChI=1S/C20H22Cl2N2O/c1-20(16-6-3-2-4-7-16)10-5-11-24(14-20)19(25)23-13-15-8-9-17(21)12-18(15)22/h2-4,6-9,12H,5,10-11,13-14H2,1H3,(H,23,25)
n/an/a 3n/an/an/an/an/an/a
Merck Research Laboratories
Curated by ChEMBL
Assay Description
Inhibition of rat soluble epoxide hydrolase
Bioorg Med Chem Lett 19: 5314-20 (2009)
Article DOI: 10.1016/j.bmcl.2009.07.138
BindingDB Entry DOI: 10.7270/Q2S75GFP