BDBM50310968 4-((3-bromo-4-(2,4-difluorobenzyloxy)-6-methyl-2-oxopyridin-1(2H)-yl)methyl)-N,N-dimethylbenzamide::CHEMBL1078804
SMILES: CN(C)C(=O)c1ccc(Cn2c(C)cc(OCc3ccc(F)cc3F)c(Br)c2=O)cc1
InChI Key: InChIKey=KEPLONZHLUBUHL-UHFFFAOYSA-N
Data: 2 IC50
Activity Spreadsheet -- Enzyme Inhibition Constant Data from BindingDB
Found 2 hits for monomerid = 50310968
Trg + Lig
Ki
nM
ΔG°
kcal/mole
IC50
nM
Kd
nM
EC50/IC50
nM
koff
s-1
kon
M-1s-1
pHTemp
°C
Mitogen-activated protein kinase 9
(Homo sapiens (Human))
BDBM50310968
(4-((3-bromo-4-(2,4-difluorobenzyloxy)-6-methyl-2-o...)
Show SMILES CN(C)C(=O)c1ccc(Cn2c(C)cc(OCc3ccc(F)cc3F)c(Br)c2=O)cc1
Show InChI InChI=1S/C23H21BrF2N2O3/c1-14-10-20(31-13-17-8-9-18(25)11-19(17)26)21(24)23(30)28(14)12-15-4-6-16(7-5-15)22(29)27(2)3/h4-11H,12-13H2,1-3H3
NCI pathway
Reactome pathway
n/an/a>2.00E+5n/an/an/an/an/an/a
Pfizer Corporation
Curated by ChEMBL
Assay Description
Inhibition of JNK2
Bioorg Med Chem Lett 19: 5851-6 (2009)
Article DOI: 10.1016/j.bmcl.2009.08.082
BindingDB Entry DOI: 10.7270/Q2HM59DG
Mitogen-activated protein kinase 14
(Homo sapiens (Human))
BDBM50310968
(4-((3-bromo-4-(2,4-difluorobenzyloxy)-6-methyl-2-o...)
Show SMILES CN(C)C(=O)c1ccc(Cn2c(C)cc(OCc3ccc(F)cc3F)c(Br)c2=O)cc1
Show InChI InChI=1S/C23H21BrF2N2O3/c1-14-10-20(31-13-17-8-9-18(25)11-19(17)26)21(24)23(30)28(14)12-15-4-6-16(7-5-15)22(29)27(2)3/h4-11H,12-13H2,1-3H3
NCI pathway
Reactome pathway
n/an/a 66n/an/an/an/an/an/a
Pfizer Corporation
Curated by ChEMBL
Assay Description
Inhibition of p38alpha
Bioorg Med Chem Lett 19: 5851-6 (2009)
Article DOI: 10.1016/j.bmcl.2009.08.082
BindingDB Entry DOI: 10.7270/Q2HM59DG