BDBM50311256 4-(2,4-dihydroxy-6-pentadecylbenzoyloxy)-2-hydroxy-6-methylbenzoic acid::CHEMBL1078307
SMILES: CCCCCCCCCCCCCCCc1cc(O)cc(O)c1C(=O)Oc1cc(C)c(C(O)=O)c(O)c1
InChI Key: InChIKey=QSTORXOHOONJBS-UHFFFAOYSA-N
Data: 1 IC50
Activity Spreadsheet -- Enzyme Inhibition Constant Data from BindingDB
Found 1 hit for monomerid = 50311256
Trg + Lig
Ki
nM
ΔG°
kcal/mole
IC50
nM
Kd
nM
EC50/IC50
nM
koff
s-1
kon
M-1s-1
pHTemp
°C
Protein-tyrosine phosphatase 1B
(Homo sapiens (Human))
BDBM50311256
(4-(2,4-dihydroxy-6-pentadecylbenzoyloxy)-2-hydroxy...)
Show SMILES CCCCCCCCCCCCCCCc1cc(O)cc(O)c1C(=O)Oc1cc(C)c(C(O)=O)c(O)c1
Show InChI InChI=1S/C30H42O7/c1-3-4-5-6-7-8-9-10-11-12-13-14-15-16-22-18-23(31)19-25(32)28(22)30(36)37-24-17-21(2)27(29(34)35)26(33)20-24/h17-20,31-33H,3-16H2,1-2H3,(H,34,35)
NCI pathway
Reactome pathway
n/an/a 220n/an/an/an/an/an/a
Silla University
Curated by ChEMBL
Assay Description
Inhibition of PTP1B mediated pNPP hydrolysis
Bioorg Med Chem Lett 19: 6095-7 (2009)
Article DOI: 10.1016/j.bmcl.2009.09.025
BindingDB Entry DOI: 10.7270/Q22J6BZQ