BDBM50311487 2-(8-cyclodecyl-1-oxo-4-phenyl-2,3,8-triazaspiro[4.5]dec-3-en-2-yl)-N-methylacetamide::CHEMBL1080464
SMILES: CNC(=O)CN1N=C(c2ccccc2)C2(CCN(CC2)C2CCCCCCCCC2)C1=O
InChI Key: InChIKey=ZGRPBBKULOZLTJ-UHFFFAOYSA-N
Data: 2 KI  1 IC50
Activity Spreadsheet -- Enzyme Inhibition Constant Data from BindingDB
Found 3 hits for monomerid = 50311487
Trg + Lig
Ki
nM
ΔG°
kcal/mole
IC50
nM
Kd
nM
EC50/IC50
nM
koff
s-1
kon
M-1s-1
pHTemp
°C
Mu-type opioid receptor
(Homo sapiens (Human))
BDBM50311487
(2-(8-cyclodecyl-1-oxo-4-phenyl-2,3,8-triazaspiro[4...)
Show SMILES CNC(=O)CN1N=C(c2ccccc2)C2(CCN(CC2)C2CCCCCCCCC2)C1=O |t:6|
Show InChI InChI=1S/C26H38N4O2/c1-27-23(31)20-30-25(32)26(24(28-30)21-12-8-7-9-13-21)16-18-29(19-17-26)22-14-10-5-3-2-4-6-11-15-22/h7-9,12-13,22H,2-6,10-11,14-20H2,1H3,(H,27,31)
NCI pathway
Reactome pathway
1.10n/an/an/an/an/an/an/an/a
Schering-Plough Research Institute
Curated by ChEMBL
Assay Description
Displacement of [3H]diprenorphine from human MOP receptor expressed in CHOK1 cells
Bioorg Med Chem Lett 19: 6441-6 (2009)
Article DOI: 10.1016/j.bmcl.2009.09.028
BindingDB Entry DOI: 10.7270/Q21J99W7
Nociceptin receptor
(Homo sapiens (Human))
BDBM50311487
(2-(8-cyclodecyl-1-oxo-4-phenyl-2,3,8-triazaspiro[4...)
Show SMILES CNC(=O)CN1N=C(c2ccccc2)C2(CCN(CC2)C2CCCCCCCCC2)C1=O |t:6|
Show InChI InChI=1S/C26H38N4O2/c1-27-23(31)20-30-25(32)26(24(28-30)21-12-8-7-9-13-21)16-18-29(19-17-26)22-14-10-5-3-2-4-6-11-15-22/h7-9,12-13,22H,2-6,10-11,14-20H2,1H3,(H,27,31)
Reactome pathway
2.30n/an/an/an/an/an/an/an/a
Schering-Plough Research Institute
Curated by ChEMBL
Assay Description
Displacement of [3H]nociceptin from human NOP receptor expressed in CHO cells
Bioorg Med Chem Lett 19: 6441-6 (2009)
Article DOI: 10.1016/j.bmcl.2009.09.028
BindingDB Entry DOI: 10.7270/Q21J99W7
Nociceptin receptor
(Homo sapiens (Human))
BDBM50311487
(2-(8-cyclodecyl-1-oxo-4-phenyl-2,3,8-triazaspiro[4...)
Show SMILES CNC(=O)CN1N=C(c2ccccc2)C2(CCN(CC2)C2CCCCCCCCC2)C1=O |t:6|
Show InChI InChI=1S/C26H38N4O2/c1-27-23(31)20-30-25(32)26(24(28-30)21-12-8-7-9-13-21)16-18-29(19-17-26)22-14-10-5-3-2-4-6-11-15-22/h7-9,12-13,22H,2-6,10-11,14-20H2,1H3,(H,27,31)
Reactome pathway
n/an/a 9.60n/an/an/an/an/an/a
Schering-Plough Research Institute
Curated by ChEMBL
Assay Description
Agonist activity at human NOP receptor expressed in CHO cells assessed as inhibition of forskolin-stimulated cAMP production after 2 hrs
Bioorg Med Chem Lett 19: 6441-6 (2009)
Article DOI: 10.1016/j.bmcl.2009.09.028
BindingDB Entry DOI: 10.7270/Q21J99W7