BDBM50311650 (+/-)-2-(1H-benzo[d]imidazol-1-yl)-9-(7-fluorochroman-4-yl)-7H-purin-8(9H)-one::CHEMBL1080110
SMILES: Fc1ccc2C(CCOc2c1)n1c2nc(ncc2[nH]c1=O)-n1cnc2ccccc12
InChI Key: InChIKey=AWYBUVIAIMRQPX-UHFFFAOYSA-N
Data: 2 IC50
Activity Spreadsheet -- Enzyme Inhibition Constant Data from BindingDB
Found 2 hits for monomerid = 50311650
Trg + Lig
Ki
nM
ΔG°
kcal/mole
IC50
nM
Kd
nM
EC50/IC50
nM
koff
s-1
kon
M-1s-1
pHTemp
°C
Tyrosine-protein kinase JAK2
(Homo sapiens (Human))
BDBM50311650
((+/-)-2-(1H-benzo[d]imidazol-1-yl)-9-(7-fluorochro...)
Show SMILES Fc1ccc2C(CCOc2c1)n1c2nc(ncc2[nH]c1=O)-n1cnc2ccccc12
Show InChI InChI=1S/C21H15FN6O2/c22-12-5-6-13-16(7-8-30-18(13)9-12)28-19-15(25-21(28)29)10-23-20(26-19)27-11-24-14-3-1-2-4-17(14)27/h1-6,9-11,16H,7-8H2,(H,25,29)
Reactome pathway
n/an/a 95n/an/an/an/an/an/a
Ligand Pharmaceuticals, Inc
Curated by ChEMBL
Assay Description
Inhibition of human JAK2 (532-1132) by time resolved fluorescence assay
Bioorg Med Chem Lett 19: 6788-92 (2009)
Article DOI: 10.1016/j.bmcl.2009.09.080
BindingDB Entry DOI: 10.7270/Q24B31G4
Tyrosine-protein kinase JAK3
(Homo sapiens (Human))
BDBM50311650
((+/-)-2-(1H-benzo[d]imidazol-1-yl)-9-(7-fluorochro...)
Show SMILES Fc1ccc2C(CCOc2c1)n1c2nc(ncc2[nH]c1=O)-n1cnc2ccccc12
Show InChI InChI=1S/C21H15FN6O2/c22-12-5-6-13-16(7-8-30-18(13)9-12)28-19-15(25-21(28)29)10-23-20(26-19)27-11-24-14-3-1-2-4-17(14)27/h1-6,9-11,16H,7-8H2,(H,25,29)
Reactome pathway
n/an/a 260n/an/an/an/an/an/a
Ligand Pharmaceuticals, Inc
Curated by ChEMBL
Assay Description
Inhibition of human JAK3 (508-1124) by time resolved fluorescence assay
Bioorg Med Chem Lett 19: 6788-92 (2009)
Article DOI: 10.1016/j.bmcl.2009.09.080
BindingDB Entry DOI: 10.7270/Q24B31G4