BDBM50311682 (4bR,10bS,12aS)-8-hydroxy-12a-methyl-2,3,4,4a,5,6,10b,11,12,12a-decahydrochrysen-1(4bH)-one::CHEMBL1081723
SMILES: C[C@]12CC[C@H]3[C@@H](CCc4cc(O)ccc34)[C@@H]1CCCC2=O
InChI Key: InChIKey=QUDQOAJKWYRREB-VXNCWWDNSA-N
Data: 1 IC50
Activity Spreadsheet -- Enzyme Inhibition Constant Data from BindingDB
Found 1 hit for monomerid = 50311682
Trg + Lig
Ki
nM
ΔG°
kcal/mole
IC50
nM
Kd
nM
EC50/IC50
nM
koff
s-1
kon
M-1s-1
pHTemp
°C
Estradiol 17-beta-dehydrogenase 1 (17beta-HSD1)
(Homo sapiens (Human))
BDBM50311682
((4bR,10bS,12aS)-8-hydroxy-12a-methyl-2,3,4,4a,5,6,...)
Show SMILES C[C@]12CC[C@H]3[C@@H](CCc4cc(O)ccc34)[C@@H]1CCCC2=O |r|
Show InChI InChI=1S/C19H24O2/c1-19-10-9-15-14-8-6-13(20)11-12(14)5-7-16(15)17(19)3-2-4-18(19)21/h6,8,11,15-17,20H,2-5,7,9-10H2,1H3/t15-,16-,17+,19+/m1/s1
Reactome pathway
n/an/a 30n/an/an/an/an/an/a
Institute of Experimental Genetics
Curated by ChEMBL
Assay Description
Inhibition of His-tagged human 17beta-HSD1 expressed in Escherichia coli by scintillation counting
Bioorg Med Chem Lett 19: 6740-4 (2009)
Article DOI: 10.1016/j.bmcl.2009.09.113
BindingDB Entry DOI: 10.7270/Q20K29HP