null
SMILES: C1Oc2ccccc2CC1c1nc2ccc(cc2s1)-c1cn[nH]c1
InChI Key: InChIKey=MSSYXOZHEIUOHK-UHFFFAOYSA-N
Activity Spreadsheet -- Enzyme Inhibition Constant Data from BindingDB
Found 2 hits for monomerid = 50311715
Trg + Lig
Ki
nM
ΔG°
kcal/mole
IC50
nM
Kd
nM
EC50/IC50
nM
koff
s-1
kon
M-1s-1
pHTemp
°C
Rho-associated protein kinase 2
(Homo sapiens (Human))
BDBM50311715
(2-(chroman-3-yl)-6-(1H-pyrazol-4-yl)benzo[d]thiazo...)
Show SMILES C1Oc2ccccc2CC1c1nc2ccc(cc2s1)-c1cn[nH]c1
Show InChI InChI=1S/C19H15N3OS/c1-2-4-17-13(3-1)7-14(11-23-17)19-22-16-6-5-12(8-18(16)24-19)15-9-20-21-10-15/h1-6,8-10,14H,7,11H2,(H,20,21)
n/an/a 1.55E+3n/an/an/an/an/an/a
Translational Research Institute and Department of Molecular Therapeutics
Curated by ChEMBL
Assay Description
Inhibition of ROCK2 assessed as myosin light chain phosphorylation by cell-based assay
Bioorg Med Chem Lett 19: 6686-90 (2009)
Article DOI: 10.1016/j.bmcl.2009.09.115
BindingDB Entry DOI: 10.7270/Q2VX0GN0
Rho-associated protein kinase 2
(Homo sapiens (Human))
BDBM50311715
(2-(chroman-3-yl)-6-(1H-pyrazol-4-yl)benzo[d]thiazo...)
Show SMILES C1Oc2ccccc2CC1c1nc2ccc(cc2s1)-c1cn[nH]c1
Show InChI InChI=1S/C19H15N3OS/c1-2-4-17-13(3-1)7-14(11-23-17)19-22-16-6-5-12(8-18(16)24-19)15-9-20-21-10-15/h1-6,8-10,14H,7,11H2,(H,20,21)
n/an/a 11n/an/an/an/an/an/a
Translational Research Institute and Department of Molecular Therapeutics
Curated by ChEMBL
Assay Description
Inhibition of ROCK2
Bioorg Med Chem Lett 19: 6686-90 (2009)
Article DOI: 10.1016/j.bmcl.2009.09.115
BindingDB Entry DOI: 10.7270/Q2VX0GN0