null
SMILES: Fc1ccc2OCC(Cc2c1)c1nc2ccc(cc2s1)-c1cn[nH]c1
InChI Key: InChIKey=BUHWXYZRRBOVCK-UHFFFAOYSA-N
Activity Spreadsheet -- Enzyme Inhibition Constant Data from BindingDB
Found 2 hits for monomerid = 50311722
Trg + Lig
Ki
nM
ΔG°
kcal/mole
IC50
nM
Kd
nM
EC50/IC50
nM
koff
s-1
kon
M-1s-1
pHTemp
°C
Rho-associated protein kinase 2
(Homo sapiens (Human))
BDBM50311722
(2-(6-fluorochroman-3-yl)-6-(1H-pyrazol-4-yl)benzo[...)
Show SMILES Fc1ccc2OCC(Cc2c1)c1nc2ccc(cc2s1)-c1cn[nH]c1
Show InChI InChI=1S/C19H14FN3OS/c20-15-2-4-17-12(6-15)5-13(10-24-17)19-23-16-3-1-11(7-18(16)25-19)14-8-21-22-9-14/h1-4,6-9,13H,5,10H2,(H,21,22)
n/an/a 38n/an/an/an/an/an/a
Translational Research Institute and Department of Molecular Therapeutics
Curated by ChEMBL
Assay Description
Inhibition of ROCK2
Bioorg Med Chem Lett 19: 6686-90 (2009)
Article DOI: 10.1016/j.bmcl.2009.09.115
BindingDB Entry DOI: 10.7270/Q2VX0GN0
Rho-associated protein kinase 2
(Homo sapiens (Human))
BDBM50311722
(2-(6-fluorochroman-3-yl)-6-(1H-pyrazol-4-yl)benzo[...)
Show SMILES Fc1ccc2OCC(Cc2c1)c1nc2ccc(cc2s1)-c1cn[nH]c1
Show InChI InChI=1S/C19H14FN3OS/c20-15-2-4-17-12(6-15)5-13(10-24-17)19-23-16-3-1-11(7-18(16)25-19)14-8-21-22-9-14/h1-4,6-9,13H,5,10H2,(H,21,22)
n/an/a 1.49E+3n/an/an/an/an/an/a
Translational Research Institute and Department of Molecular Therapeutics
Curated by ChEMBL
Assay Description
Inhibition of ROCK2 assessed as myosin light chain phosphorylation by cell-based assay
Bioorg Med Chem Lett 19: 6686-90 (2009)
Article DOI: 10.1016/j.bmcl.2009.09.115
BindingDB Entry DOI: 10.7270/Q2VX0GN0