BDBM50311798 4-(4-(3-(2-chloro-3,6-difluorophenoxy)propyl)phenyl)-N-cyclopropyl-N-(2,3-dichlorobenzyl)-1,2,5,6-tetrahydropyridine-3-carboxamide::CHEMBL1088290
SMILES: Fc1ccc(F)c(OCCCc2ccc(cc2)C2=C(CNCC2)C(=O)N(Cc2cccc(Cl)c2Cl)C2CC2)c1Cl
InChI Key: InChIKey=LEPZPTOEMLDSMH-UHFFFAOYSA-N
Data: 3 IC50
Activity Spreadsheet -- Enzyme Inhibition Constant Data from BindingDB
Found 3 hits for monomerid = 50311798
Trg + Lig
Ki
nM
ΔG°
kcal/mole
IC50
nM
Kd
nM
EC50/IC50
nM
koff
s-1
kon
M-1s-1
pHTemp
°C
Renin
(Homo sapiens (Human))
BDBM50311798
(4-(4-(3-(2-chloro-3,6-difluorophenoxy)propyl)pheny...)
Show SMILES Fc1ccc(F)c(OCCCc2ccc(cc2)C2=C(CNCC2)C(=O)N(Cc2cccc(Cl)c2Cl)C2CC2)c1Cl |t:18|
Show InChI InChI=1S/C31H29Cl3F2N2O2/c32-25-5-1-4-21(28(25)33)18-38(22-10-11-22)31(39)24-17-37-15-14-23(24)20-8-6-19(7-9-20)3-2-16-40-30-27(36)13-12-26(35)29(30)34/h1,4-9,12-13,22,37H,2-3,10-11,14-18H2
Reactome pathway
n/an/a 53n/an/an/an/an/an/a
Actelion Pharmaceuticals Ltd
Curated by ChEMBL
Assay Description
Inhibition of human rennin in human plasma assessed as accumulation of angiotensin 1 using human tetradecapeptide by immunoassay
Bioorg Med Chem Lett 19: 6762-5 (2009)
Article DOI: 10.1016/j.bmcl.2009.09.104
BindingDB Entry DOI: 10.7270/Q23F4PRP
Cytochrome P450 3A4
(Homo sapiens (Human))
BDBM50311798
(4-(4-(3-(2-chloro-3,6-difluorophenoxy)propyl)pheny...)
Show SMILES Fc1ccc(F)c(OCCCc2ccc(cc2)C2=C(CNCC2)C(=O)N(Cc2cccc(Cl)c2Cl)C2CC2)c1Cl |t:18|
Show InChI InChI=1S/C31H29Cl3F2N2O2/c32-25-5-1-4-21(28(25)33)18-38(22-10-11-22)31(39)24-17-37-15-14-23(24)20-8-6-19(7-9-20)3-2-16-40-30-27(36)13-12-26(35)29(30)34/h1,4-9,12-13,22,37H,2-3,10-11,14-18H2
Reactome pathway
n/an/a 1.30E+3n/an/an/an/an/an/a
Actelion Pharmaceuticals Ltd
Curated by ChEMBL
Assay Description
Inhibition of CYP3A4
Bioorg Med Chem Lett 19: 6762-5 (2009)
Article DOI: 10.1016/j.bmcl.2009.09.104
BindingDB Entry DOI: 10.7270/Q23F4PRP
Renin
(Homo sapiens (Human))
BDBM50311798
(4-(4-(3-(2-chloro-3,6-difluorophenoxy)propyl)pheny...)
Show SMILES Fc1ccc(F)c(OCCCc2ccc(cc2)C2=C(CNCC2)C(=O)N(Cc2cccc(Cl)c2Cl)C2CC2)c1Cl |t:18|
Show InChI InChI=1S/C31H29Cl3F2N2O2/c32-25-5-1-4-21(28(25)33)18-38(22-10-11-22)31(39)24-17-37-15-14-23(24)20-8-6-19(7-9-20)3-2-16-40-30-27(36)13-12-26(35)29(30)34/h1,4-9,12-13,22,37H,2-3,10-11,14-18H2
Reactome pathway
n/an/a 1.20n/an/an/an/an/an/a
Actelion Pharmaceuticals Ltd
Curated by ChEMBL
Assay Description
Inhibition of human rennin in buffer assessed as accumulation of angiotensin 1 using human tetradecapeptide by immunoassay
Bioorg Med Chem Lett 19: 6762-5 (2009)
Article DOI: 10.1016/j.bmcl.2009.09.104
BindingDB Entry DOI: 10.7270/Q23F4PRP