BDBM50311910 3-(1-(6-(4-(diethylamino)butylamino)pyrimidin-4-yl)-1H-benzo[d]imidazol-2-ylamino)-4-methyl-N-(3-(trifluoromethyl)phenyl)benzamide::CHEMBL1076199
SMILES: CCN(CC)CCCCNc1cc(ncn1)-n1c(Nc2cc(ccc2C)C(=O)Nc2cccc(c2)C(F)(F)F)nc2ccccc12
InChI Key: InChIKey=NITOVUIHLVISSN-UHFFFAOYSA-N
Data: 8 IC50
Activity Spreadsheet -- Enzyme Inhibition Constant Data from BindingDB
Found 8 hits for monomerid = 50311910
Trg + Lig
Ki
nM
ΔG°
kcal/mole
IC50
nM
Kd
nM
EC50/IC50
nM
koff
s-1
kon
M-1s-1
pHTemp
°C
Proto-oncogene tyrosine-protein kinase Src
(Homo sapiens (Human))
BDBM50311910
(3-(1-(6-(4-(diethylamino)butylamino)pyrimidin-4-yl...)
Show SMILES CCN(CC)CCCCNc1cc(ncn1)-n1c(Nc2cc(ccc2C)C(=O)Nc2cccc(c2)C(F)(F)F)nc2ccccc12
Show InChI InChI=1S/C34H37F3N8O/c1-4-44(5-2)18-9-8-17-38-30-21-31(40-22-39-30)45-29-14-7-6-13-27(29)42-33(45)43-28-19-24(16-15-23(28)3)32(46)41-26-12-10-11-25(20-26)34(35,36)37/h6-7,10-16,19-22H,4-5,8-9,17-18H2,1-3H3,(H,41,46)(H,42,43)(H,38,39,40)
n/an/a 274n/an/an/an/an/an/a
Genomics Institute of the Novartis Research Foundation (GNF)
Curated by ChEMBL
Assay Description
Inhibition of SRC
Bioorg Med Chem Lett 19: 6691-5 (2009)
Article DOI: 10.1016/j.bmcl.2009.09.123
BindingDB Entry DOI: 10.7270/Q2Q52PRR
Tyrosine-protein kinase Lck
(Homo sapiens (Human))
BDBM50311910
(3-(1-(6-(4-(diethylamino)butylamino)pyrimidin-4-yl...)
Show SMILES CCN(CC)CCCCNc1cc(ncn1)-n1c(Nc2cc(ccc2C)C(=O)Nc2cccc(c2)C(F)(F)F)nc2ccccc12
Show InChI InChI=1S/C34H37F3N8O/c1-4-44(5-2)18-9-8-17-38-30-21-31(40-22-39-30)45-29-14-7-6-13-27(29)42-33(45)43-28-19-24(16-15-23(28)3)32(46)41-26-12-10-11-25(20-26)34(35,36)37/h6-7,10-16,19-22H,4-5,8-9,17-18H2,1-3H3,(H,41,46)(H,42,43)(H,38,39,40)
n/an/a 18n/an/an/an/an/an/a
Genomics Institute of the Novartis Research Foundation (GNF)
Curated by ChEMBL
Assay Description
Inhibition of LCK
Bioorg Med Chem Lett 19: 6691-5 (2009)
Article DOI: 10.1016/j.bmcl.2009.09.123
BindingDB Entry DOI: 10.7270/Q2Q52PRR
Insulin receptor
(Homo sapiens (Human))
BDBM50311910
(3-(1-(6-(4-(diethylamino)butylamino)pyrimidin-4-yl...)
Show SMILES CCN(CC)CCCCNc1cc(ncn1)-n1c(Nc2cc(ccc2C)C(=O)Nc2cccc(c2)C(F)(F)F)nc2ccccc12
Show InChI InChI=1S/C34H37F3N8O/c1-4-44(5-2)18-9-8-17-38-30-21-31(40-22-39-30)45-29-14-7-6-13-27(29)42-33(45)43-28-19-24(16-15-23(28)3)32(46)41-26-12-10-11-25(20-26)34(35,36)37/h6-7,10-16,19-22H,4-5,8-9,17-18H2,1-3H3,(H,41,46)(H,42,43)(H,38,39,40)
n/an/a 1.81E+3n/an/an/an/an/an/a
Genomics Institute of the Novartis Research Foundation (GNF)
Curated by ChEMBL
Assay Description
Inhibition of Tel-fused InsR expressed in mouse BAF3 cells
Bioorg Med Chem Lett 19: 6691-5 (2009)
Article DOI: 10.1016/j.bmcl.2009.09.123
BindingDB Entry DOI: 10.7270/Q2Q52PRR
Vascular endothelial growth factor receptor 2
(Homo sapiens (Human))
BDBM50311910
(3-(1-(6-(4-(diethylamino)butylamino)pyrimidin-4-yl...)
Show SMILES CCN(CC)CCCCNc1cc(ncn1)-n1c(Nc2cc(ccc2C)C(=O)Nc2cccc(c2)C(F)(F)F)nc2ccccc12
Show InChI InChI=1S/C34H37F3N8O/c1-4-44(5-2)18-9-8-17-38-30-21-31(40-22-39-30)45-29-14-7-6-13-27(29)42-33(45)43-28-19-24(16-15-23(28)3)32(46)41-26-12-10-11-25(20-26)34(35,36)37/h6-7,10-16,19-22H,4-5,8-9,17-18H2,1-3H3,(H,41,46)(H,42,43)(H,38,39,40)
NCI pathway
Reactome pathway
n/an/a 243n/an/an/an/an/an/a
Genomics Institute of the Novartis Research Foundation (GNF)
Curated by ChEMBL
Assay Description
Inhibition of Tel-fused KDR expressed in mouse BAF3 cells
Bioorg Med Chem Lett 19: 6691-5 (2009)
Article DOI: 10.1016/j.bmcl.2009.09.123
BindingDB Entry DOI: 10.7270/Q2Q52PRR
Tyrosine-protein kinase Lck
(Homo sapiens (Human))
BDBM50311910
(3-(1-(6-(4-(diethylamino)butylamino)pyrimidin-4-yl...)
Show SMILES CCN(CC)CCCCNc1cc(ncn1)-n1c(Nc2cc(ccc2C)C(=O)Nc2cccc(c2)C(F)(F)F)nc2ccccc12
Show InChI InChI=1S/C34H37F3N8O/c1-4-44(5-2)18-9-8-17-38-30-21-31(40-22-39-30)45-29-14-7-6-13-27(29)42-33(45)43-28-19-24(16-15-23(28)3)32(46)41-26-12-10-11-25(20-26)34(35,36)37/h6-7,10-16,19-22H,4-5,8-9,17-18H2,1-3H3,(H,41,46)(H,42,43)(H,38,39,40)
n/an/a 52n/an/an/an/an/an/a
Genomics Institute of the Novartis Research Foundation (GNF)
Curated by ChEMBL
Assay Description
Inhibition of Tel-fused LCK expressed in mouse BAF3 cells
Bioorg Med Chem Lett 19: 6691-5 (2009)
Article DOI: 10.1016/j.bmcl.2009.09.123
BindingDB Entry DOI: 10.7270/Q2Q52PRR
Tyrosine-protein kinase Lyn
(Homo sapiens (Human))
BDBM50311910
(3-(1-(6-(4-(diethylamino)butylamino)pyrimidin-4-yl...)
Show SMILES CCN(CC)CCCCNc1cc(ncn1)-n1c(Nc2cc(ccc2C)C(=O)Nc2cccc(c2)C(F)(F)F)nc2ccccc12
Show InChI InChI=1S/C34H37F3N8O/c1-4-44(5-2)18-9-8-17-38-30-21-31(40-22-39-30)45-29-14-7-6-13-27(29)42-33(45)43-28-19-24(16-15-23(28)3)32(46)41-26-12-10-11-25(20-26)34(35,36)37/h6-7,10-16,19-22H,4-5,8-9,17-18H2,1-3H3,(H,41,46)(H,42,43)(H,38,39,40)
Reactome pathway
n/an/a 140n/an/an/an/an/an/a
Genomics Institute of the Novartis Research Foundation (GNF)
Curated by ChEMBL
Assay Description
Inhibition of Tel-fused LYN expressed in mouse BAF3 cells
Bioorg Med Chem Lett 19: 6691-5 (2009)
Article DOI: 10.1016/j.bmcl.2009.09.123
BindingDB Entry DOI: 10.7270/Q2Q52PRR
Proto-oncogene tyrosine-protein kinase Src
(Homo sapiens (Human))
BDBM50311910
(3-(1-(6-(4-(diethylamino)butylamino)pyrimidin-4-yl...)
Show SMILES CCN(CC)CCCCNc1cc(ncn1)-n1c(Nc2cc(ccc2C)C(=O)Nc2cccc(c2)C(F)(F)F)nc2ccccc12
Show InChI InChI=1S/C34H37F3N8O/c1-4-44(5-2)18-9-8-17-38-30-21-31(40-22-39-30)45-29-14-7-6-13-27(29)42-33(45)43-28-19-24(16-15-23(28)3)32(46)41-26-12-10-11-25(20-26)34(35,36)37/h6-7,10-16,19-22H,4-5,8-9,17-18H2,1-3H3,(H,41,46)(H,42,43)(H,38,39,40)
n/an/a 461n/an/an/an/an/an/a
Genomics Institute of the Novartis Research Foundation (GNF)
Curated by ChEMBL
Assay Description
Inhibition of Tel-fused SRC expressed in mouse BAF3 cells
Bioorg Med Chem Lett 19: 6691-5 (2009)
Article DOI: 10.1016/j.bmcl.2009.09.123
BindingDB Entry DOI: 10.7270/Q2Q52PRR
Tyrosine-protein kinase HCK
(Homo sapiens (Human))
BDBM50311910
(3-(1-(6-(4-(diethylamino)butylamino)pyrimidin-4-yl...)
Show SMILES CCN(CC)CCCCNc1cc(ncn1)-n1c(Nc2cc(ccc2C)C(=O)Nc2cccc(c2)C(F)(F)F)nc2ccccc12
Show InChI InChI=1S/C34H37F3N8O/c1-4-44(5-2)18-9-8-17-38-30-21-31(40-22-39-30)45-29-14-7-6-13-27(29)42-33(45)43-28-19-24(16-15-23(28)3)32(46)41-26-12-10-11-25(20-26)34(35,36)37/h6-7,10-16,19-22H,4-5,8-9,17-18H2,1-3H3,(H,41,46)(H,42,43)(H,38,39,40)
Reactome pathway
n/an/a 475n/an/an/an/an/an/a
Genomics Institute of the Novartis Research Foundation (GNF)
Curated by ChEMBL
Assay Description
Inhibition of HCK
Bioorg Med Chem Lett 19: 6691-5 (2009)
Article DOI: 10.1016/j.bmcl.2009.09.123
BindingDB Entry DOI: 10.7270/Q2Q52PRR