BDBM50311986 5-(7-(4-((1S,4S)-5-ethyl-2,5-diazabicyclo[2.2.1]heptan-2-yl)phenyl)-2-(pyridin-4-yl)pyrazolo[1,5-a]pyrimidin-3-yl)-2-fluorophenol::CHEMBL1080650
SMILES: CCN1C[C@@H]2C[C@H]1CN2c1ccc(cc1)-c1ccnc2c(c(nn12)-c1ccncc1)-c1ccc(F)c(O)c1
InChI Key: InChIKey=FBJYRNGBDFBGRM-ZEQRLZLVSA-N
Data: 1 IC50
Activity Spreadsheet -- Enzyme Inhibition Constant Data from BindingDB
Found 1 hit for monomerid = 50311986
Trg + Lig
Ki
nM
ΔG°
kcal/mole
IC50
nM
Kd
nM
EC50/IC50
nM
koff
s-1
kon
M-1s-1
pHTemp
°C
Serine/threonine-protein kinase B-raf
(Homo sapiens (Human))
BDBM50311986
(5-(7-(4-((1S,4S)-5-ethyl-2,5-diazabicyclo[2.2.1]he...)
Show SMILES CCN1C[C@@H]2C[C@H]1CN2c1ccc(cc1)-c1ccnc2c(c(nn12)-c1ccncc1)-c1ccc(F)c(O)c1 |r|
Show InChI InChI=1S/C30H27FN6O/c1-2-35-17-24-16-23(35)18-36(24)22-6-3-19(4-7-22)26-11-14-33-30-28(21-5-8-25(31)27(38)15-21)29(34-37(26)30)20-9-12-32-13-10-20/h3-15,23-24,38H,2,16-18H2,1H3/t23-,24-/m0/s1
NCI pathway
Reactome pathway
n/an/a 0.510n/an/an/an/an/an/a
Wyeth Research
Curated by ChEMBL
Assay Description
Inhibition of human recombinant B-Raf expressed in Sf9 cells assessed as inhibition of Mek1 phosphorylation
Bioorg Med Chem Lett 19: 6571-4 (2009)
Article DOI: 10.1016/j.bmcl.2009.10.030
BindingDB Entry DOI: 10.7270/Q29Z9510