BDBM50312173 1-(4-methyl-3-(trifluoromethyl)phenyl)-3-(3-(8-(pyridin-4-ylmethylamino)imidazo[1,2-a]pyrazin-6-yl)phenyl)urea::CHEMBL1079751
SMILES: Cc1ccc(NC(=O)Nc2cccc(c2)-c2cn3ccnc3c(NCc3ccncc3)n2)cc1C(F)(F)F
InChI Key: InChIKey=CXRYSQNWQCVBQV-UHFFFAOYSA-N
Data: 1 IC50
Activity Spreadsheet -- Enzyme Inhibition Constant Data from BindingDB
Found 1 hit for monomerid = 50312173
Trg + Lig
Ki
nM
ΔG°
kcal/mole
IC50
nM
Kd
nM
EC50/IC50
nM
koff
s-1
kon
M-1s-1
pHTemp
°C
Ephrin type-B receptor 4
(Homo sapiens (Human))
BDBM50312173
(1-(4-methyl-3-(trifluoromethyl)phenyl)-3-(3-(8-(py...)
Show SMILES Cc1ccc(NC(=O)Nc2cccc(c2)-c2cn3ccnc3c(NCc3ccncc3)n2)cc1C(F)(F)F
Show InChI InChI=1S/C27H22F3N7O/c1-17-5-6-21(14-22(17)27(28,29)30)35-26(38)34-20-4-2-3-19(13-20)23-16-37-12-11-32-25(37)24(36-23)33-15-18-7-9-31-10-8-18/h2-14,16H,15H2,1H3,(H,33,36)(H2,34,35,38)
Reactome pathway
n/an/a 810n/an/an/an/an/an/a
CGI Pharmaceuticals, Inc.
Curated by ChEMBL
Assay Description
Inhibition of EphB4 autophosphorylation by cell based assay
Bioorg Med Chem Lett 19: 6991-5 (2009)
Article DOI: 10.1016/j.bmcl.2009.10.037
BindingDB Entry DOI: 10.7270/Q2DR2VM3