BDBM50312197 1-(3-chlorophenyl)-3-(3-(8-(pyridin-4-ylmethylamino)imidazo[1,2-a]pyrazin-6-yl)phenyl)urea::CHEMBL1080024
SMILES: Clc1cccc(NC(=O)Nc2cccc(c2)-c2cn3ccnc3c(NCc3ccncc3)n2)c1
InChI Key: InChIKey=PAYXSLMAIACIHH-UHFFFAOYSA-N
Data: 1 IC50
Activity Spreadsheet -- Enzyme Inhibition Constant Data from BindingDB
Found 1 hit for monomerid = 50312197
Trg + Lig
Ki
nM
ΔG°
kcal/mole
IC50
nM
Kd
nM
EC50/IC50
nM
koff
s-1
kon
M-1s-1
pHTemp
°C
Ephrin type-B receptor 4
(Homo sapiens (Human))
BDBM50312197
(1-(3-chlorophenyl)-3-(3-(8-(pyridin-4-ylmethylamin...)
Show SMILES Clc1cccc(NC(=O)Nc2cccc(c2)-c2cn3ccnc3c(NCc3ccncc3)n2)c1
Show InChI InChI=1S/C25H20ClN7O/c26-19-4-2-6-21(14-19)31-25(34)30-20-5-1-3-18(13-20)22-16-33-12-11-28-24(33)23(32-22)29-15-17-7-9-27-10-8-17/h1-14,16H,15H2,(H,29,32)(H2,30,31,34)
Reactome pathway
n/an/a 165n/an/an/an/an/an/a
CGI Pharmaceuticals, Inc.
Curated by ChEMBL
Assay Description
Inhibition of EphB4 autophosphorylation by cell based assay
Bioorg Med Chem Lett 19: 6991-5 (2009)
Article DOI: 10.1016/j.bmcl.2009.10.037
BindingDB Entry DOI: 10.7270/Q2DR2VM3