BDBM50312380 2-(2-methyl-4-((4-methyl-5-p-tolylthiazol-2-yl)methoxy)phenoxy)acetic acid::CHEMBL1075856
SMILES: Cc1nc(COc2ccc(OCC(O)=O)c(C)c2)sc1-c1ccc(C)cc1
InChI Key: InChIKey=ZQQVIVSFEQIIMG-UHFFFAOYSA-N
Data: 3 EC50
Activity Spreadsheet -- Enzyme Inhibition Constant Data from BindingDB
Found 3 hits for monomerid = 50312380
Trg + Lig
Ki
nM
ΔG°
kcal/mole
IC50
nM
Kd
nM
EC50/IC50
nM
koff
s-1
kon
M-1s-1
pHTemp
°C
Peroxisome proliferator-activated receptor delta
(Homo sapiens (Human))
BDBM50312380
(2-(2-methyl-4-((4-methyl-5-p-tolylthiazol-2-yl)met...)
Show SMILES Cc1nc(COc2ccc(OCC(O)=O)c(C)c2)sc1-c1ccc(C)cc1
Show InChI InChI=1S/C21H21NO4S/c1-13-4-6-16(7-5-13)21-15(3)22-19(27-21)11-25-17-8-9-18(14(2)10-17)26-12-20(23)24/h4-10H,11-12H2,1-3H3,(H,23,24)
n/an/an/an/a 6.32E+3n/an/an/an/a
The Genomics Institute of the Novartis Research Foundation
Curated by ChEMBL
Assay Description
Agonist activity at human PPARdelta ligand binding domain expressed in human 293T cells cotransfected with Gal4-DBD by luciferase transactivation ass...
J Med Chem 53: 77-105 (2010)
Article DOI: 10.1021/jm9007399
BindingDB Entry DOI: 10.7270/Q28052RP
Peroxisome proliferator-activated receptor gamma
(Homo sapiens (Human))
BDBM50312380
(2-(2-methyl-4-((4-methyl-5-p-tolylthiazol-2-yl)met...)
Show SMILES Cc1nc(COc2ccc(OCC(O)=O)c(C)c2)sc1-c1ccc(C)cc1
Show InChI InChI=1S/C21H21NO4S/c1-13-4-6-16(7-5-13)21-15(3)22-19(27-21)11-25-17-8-9-18(14(2)10-17)26-12-20(23)24/h4-10H,11-12H2,1-3H3,(H,23,24)
NCI pathway
Reactome pathway
n/an/an/an/a>1.00E+4n/an/an/an/a
The Genomics Institute of the Novartis Research Foundation
Curated by ChEMBL
Assay Description
Agonist activity at human PPARgamma ligand binding domain expressed in human 293T cells cotransfected with Gal4-DBD by luciferase transactivation ass...
J Med Chem 53: 77-105 (2010)
Article DOI: 10.1021/jm9007399
BindingDB Entry DOI: 10.7270/Q28052RP
Peroxisome proliferator-activated receptor alpha
(Homo sapiens (Human))
BDBM50312380
(2-(2-methyl-4-((4-methyl-5-p-tolylthiazol-2-yl)met...)
Show SMILES Cc1nc(COc2ccc(OCC(O)=O)c(C)c2)sc1-c1ccc(C)cc1
Show InChI InChI=1S/C21H21NO4S/c1-13-4-6-16(7-5-13)21-15(3)22-19(27-21)11-25-17-8-9-18(14(2)10-17)26-12-20(23)24/h4-10H,11-12H2,1-3H3,(H,23,24)
n/an/an/an/a>1.00E+4n/an/an/an/a
The Genomics Institute of the Novartis Research Foundation
Curated by ChEMBL
Assay Description
Agonist activity at human PPARalpha ligand binding domain expressed in human 293T cells cotransfected with Gal4-DBD by luciferase transactivation ass...
J Med Chem 53: 77-105 (2010)
Article DOI: 10.1021/jm9007399
BindingDB Entry DOI: 10.7270/Q28052RP