BDBM50312382 2-(4-((5-(4-chlorophenyl)-4-methylthiazol-2-yl)methoxy)-2-methylphenoxy)acetic acid::CHEMBL1081949
SMILES: Cc1nc(COc2ccc(OCC(O)=O)c(C)c2)sc1-c1ccc(Cl)cc1
InChI Key: InChIKey=HUVSXNPATVUAJN-UHFFFAOYSA-N
Data: 3 EC50
Activity Spreadsheet -- Enzyme Inhibition Constant Data from BindingDB
Found 3 hits for monomerid = 50312382
Trg + Lig
Ki
nM
ΔG°
kcal/mole
IC50
nM
Kd
nM
EC50/IC50
nM
koff
s-1
kon
M-1s-1
pHTemp
°C
Peroxisome proliferator-activated receptor delta
(Homo sapiens (Human))
BDBM50312382
(2-(4-((5-(4-chlorophenyl)-4-methylthiazol-2-yl)met...)
Show SMILES Cc1nc(COc2ccc(OCC(O)=O)c(C)c2)sc1-c1ccc(Cl)cc1
Show InChI InChI=1S/C20H18ClNO4S/c1-12-9-16(7-8-17(12)26-11-19(23)24)25-10-18-22-13(2)20(27-18)14-3-5-15(21)6-4-14/h3-9H,10-11H2,1-2H3,(H,23,24)
n/an/an/an/a 320n/an/an/an/a
The Genomics Institute of the Novartis Research Foundation
Curated by ChEMBL
Assay Description
Agonist activity at human PPARdelta ligand binding domain expressed in human 293T cells cotransfected with Gal4-DBD by luciferase transactivation ass...
J Med Chem 53: 77-105 (2010)
Article DOI: 10.1021/jm9007399
BindingDB Entry DOI: 10.7270/Q28052RP
Peroxisome proliferator-activated receptor gamma
(Homo sapiens (Human))
BDBM50312382
(2-(4-((5-(4-chlorophenyl)-4-methylthiazol-2-yl)met...)
Show SMILES Cc1nc(COc2ccc(OCC(O)=O)c(C)c2)sc1-c1ccc(Cl)cc1
Show InChI InChI=1S/C20H18ClNO4S/c1-12-9-16(7-8-17(12)26-11-19(23)24)25-10-18-22-13(2)20(27-18)14-3-5-15(21)6-4-14/h3-9H,10-11H2,1-2H3,(H,23,24)
NCI pathway
Reactome pathway
n/an/an/an/a>1.00E+4n/an/an/an/a
The Genomics Institute of the Novartis Research Foundation
Curated by ChEMBL
Assay Description
Agonist activity at human PPARgamma ligand binding domain expressed in human 293T cells cotransfected with Gal4-DBD by luciferase transactivation ass...
J Med Chem 53: 77-105 (2010)
Article DOI: 10.1021/jm9007399
BindingDB Entry DOI: 10.7270/Q28052RP
Peroxisome proliferator-activated receptor alpha
(Homo sapiens (Human))
BDBM50312382
(2-(4-((5-(4-chlorophenyl)-4-methylthiazol-2-yl)met...)
Show SMILES Cc1nc(COc2ccc(OCC(O)=O)c(C)c2)sc1-c1ccc(Cl)cc1
Show InChI InChI=1S/C20H18ClNO4S/c1-12-9-16(7-8-17(12)26-11-19(23)24)25-10-18-22-13(2)20(27-18)14-3-5-15(21)6-4-14/h3-9H,10-11H2,1-2H3,(H,23,24)
n/an/an/an/a>1.00E+4n/an/an/an/a
The Genomics Institute of the Novartis Research Foundation
Curated by ChEMBL
Assay Description
Agonist activity at human PPARalpha ligand binding domain expressed in human 293T cells cotransfected with Gal4-DBD by luciferase transactivation ass...
J Med Chem 53: 77-105 (2010)
Article DOI: 10.1021/jm9007399
BindingDB Entry DOI: 10.7270/Q28052RP