BDBM50312603 CHEMBL1084429::N-cyclohexyl-4-{(2,4-dichlorophenyl)[4-(trifluoromethyl)phenyl]methyl}piperazine-1-carboxamide
SMILES: FC(F)(F)c1ccc(cc1)C(N1CCN(CC1)C(=O)NC1CCCCC1)c1ccc(Cl)cc1Cl
InChI Key: InChIKey=KTCTVGKANNGXFB-UHFFFAOYSA-N
Data: 2 KI  1 IC50
Activity Spreadsheet -- Enzyme Inhibition Constant Data from BindingDB
Found 3 hits for monomerid = 50312603
Trg + Lig
Ki
nM
ΔG°
kcal/mole
IC50
nM
Kd
nM
EC50/IC50
nM
koff
s-1
kon
M-1s-1
pHTemp
°C
Cannabinoid receptor 1
(Homo sapiens (Human))
BDBM50312603
(CHEMBL1084429 | N-cyclohexyl-4-{(2,4-dichloropheny...)
Show SMILES FC(F)(F)c1ccc(cc1)C(N1CCN(CC1)C(=O)NC1CCCCC1)c1ccc(Cl)cc1Cl
Show InChI InChI=1S/C25H28Cl2F3N3O/c26-19-10-11-21(22(27)16-19)23(17-6-8-18(9-7-17)25(28,29)30)32-12-14-33(15-13-32)24(34)31-20-4-2-1-3-5-20/h6-11,16,20,23H,1-5,12-15H2,(H,31,34)
NCI pathway
Reactome pathway
1.20n/an/an/an/an/an/an/an/a
Chinese Academy of Sciences
Curated by ChEMBL
Assay Description
Displacement of [3H]CP-55940 from human recombinant cannabinoid CB1 receptor expressed in CHO cells after 3 hrs by liquid scintillation counting
Eur J Med Chem 45: 1133-9 (2010)
Article DOI: 10.1016/j.ejmech.2009.12.018
BindingDB Entry DOI: 10.7270/Q2K937P0
Cannabinoid receptor 2
(Homo sapiens (Human))
BDBM50312603
(CHEMBL1084429 | N-cyclohexyl-4-{(2,4-dichloropheny...)
Show SMILES FC(F)(F)c1ccc(cc1)C(N1CCN(CC1)C(=O)NC1CCCCC1)c1ccc(Cl)cc1Cl
Show InChI InChI=1S/C25H28Cl2F3N3O/c26-19-10-11-21(22(27)16-19)23(17-6-8-18(9-7-17)25(28,29)30)32-12-14-33(15-13-32)24(34)31-20-4-2-1-3-5-20/h6-11,16,20,23H,1-5,12-15H2,(H,31,34)
Reactome pathway
274n/an/an/an/an/an/an/an/a
Chinese Academy of Sciences
Curated by ChEMBL
Assay Description
Displacement of [3H]CP-55940 from human recombinant cannabinoid CB2 receptor expressed in CHO cells after 3 hrs by liquid scintillation counting
Eur J Med Chem 45: 1133-9 (2010)
Article DOI: 10.1016/j.ejmech.2009.12.018
BindingDB Entry DOI: 10.7270/Q2K937P0
Cannabinoid receptor 1
(Homo sapiens (Human))
BDBM50312603
(CHEMBL1084429 | N-cyclohexyl-4-{(2,4-dichloropheny...)
Show SMILES FC(F)(F)c1ccc(cc1)C(N1CCN(CC1)C(=O)NC1CCCCC1)c1ccc(Cl)cc1Cl
Show InChI InChI=1S/C25H28Cl2F3N3O/c26-19-10-11-21(22(27)16-19)23(17-6-8-18(9-7-17)25(28,29)30)32-12-14-33(15-13-32)24(34)31-20-4-2-1-3-5-20/h6-11,16,20,23H,1-5,12-15H2,(H,31,34)
NCI pathway
Reactome pathway
n/an/a 57n/an/an/an/an/an/a
Chinese Academy of Sciences
Curated by ChEMBL
Assay Description
Antagonist activity at human cannabinoid CB1 receptor expressed in CHO cells coexpressing Galpha15/16 assessed as inhibition of CP55940-induced Ca2+ ...
Eur J Med Chem 45: 1133-9 (2010)
Article DOI: 10.1016/j.ejmech.2009.12.018
BindingDB Entry DOI: 10.7270/Q2K937P0