BDBM50312619 (4-(6-((4-(Methylsulfonyl)piperazin-1-yl)methyl)-2-phenylthieno-[3,2-d]pyrimidin-4-yl)morpholine::CHEMBL1085159
SMILES: CS(=O)(=O)N1CCN(Cc2cc3nc(nc(N4CCOCC4)c3s2)-c2ccccc2)CC1
InChI Key: InChIKey=SQTKRVQOAMDAGJ-UHFFFAOYSA-N
Data: 1 IC50
Activity Spreadsheet -- Enzyme Inhibition Constant Data from BindingDB
Found 1 hit for monomerid = 50312619
Trg + Lig
Ki
nM
ΔG°
kcal/mole
IC50
nM
Kd
nM
EC50/IC50
nM
koff
s-1
kon
M-1s-1
pHTemp
°C
Phosphatidylinositol 4,5-bisphosphate 3-kinase catalytic subunit alpha isoform
(Homo sapiens (Human))
BDBM50312619
((4-(6-((4-(Methylsulfonyl)piperazin-1-yl)methyl)-2...)
Show SMILES CS(=O)(=O)N1CCN(Cc2cc3nc(nc(N4CCOCC4)c3s2)-c2ccccc2)CC1
Show InChI InChI=1S/C22H27N5O3S2/c1-32(28,29)27-9-7-25(8-10-27)16-18-15-19-20(31-18)22(26-11-13-30-14-12-26)24-21(23-19)17-5-3-2-4-6-17/h2-6,15H,7-14,16H2,1H3
NCI pathway
Reactome pathway
n/an/a 430n/an/an/an/an/an/a
Genentech
Curated by ChEMBL
Assay Description
Inhibition of recombinant PI3Kalpha assessed as PIP3 product formation by fluorescence polarization assay
J Med Chem 53: 1086-97 (2010)
Article DOI: 10.1021/jm901284w
BindingDB Entry DOI: 10.7270/Q2FJ2GXT