BDBM50312910 2-(2-(bis(4-fluorophenyl)amino)-4-(4-fluorophenyl)thiazol-5-yl)acetic acid::CHEMBL1087030
SMILES: OC(=O)Cc1sc(nc1-c1ccc(F)cc1)N(c1ccc(F)cc1)c1ccc(F)cc1
InChI Key: InChIKey=VMNKSOGBAMTBBS-UHFFFAOYSA-N
Data: 2 IC50
Activity Spreadsheet -- Enzyme Inhibition Constant Data from BindingDB
Found 2 hits for monomerid = 50312910
Trg + Lig
Ki
nM
ΔG°
kcal/mole
IC50
nM
Kd
nM
EC50/IC50
nM
koff
s-1
kon
M-1s-1
pHTemp
°C
G protein-coupled receptor 44
(Homo sapiens (Human))
BDBM50312910
(2-(2-(bis(4-fluorophenyl)amino)-4-(4-fluorophenyl)...)
Show SMILES OC(=O)Cc1sc(nc1-c1ccc(F)cc1)N(c1ccc(F)cc1)c1ccc(F)cc1
Show InChI InChI=1S/C23H15F3N2O2S/c24-15-3-1-14(2-4-15)22-20(13-21(29)30)31-23(27-22)28(18-9-5-16(25)6-10-18)19-11-7-17(26)8-12-19/h1-12H,13H2,(H,29,30)
Reactome pathway
n/an/a 0.240n/an/an/an/an/an/a
7TM Pharma A/S
Curated by ChEMBL
Assay Description
Antagonist activity at human CRTH2 receptor expressed in HEK385-7 cells assessed as inhibition of PGD2-mediated beta-arrestin translocation preincuba...
Bioorg Med Chem Lett 20: 1638-41 (2010)
Article DOI: 10.1016/j.bmcl.2010.01.092
BindingDB Entry DOI: 10.7270/Q2416X6B
G protein-coupled receptor 44
(Homo sapiens (Human))
BDBM50312910
(2-(2-(bis(4-fluorophenyl)amino)-4-(4-fluorophenyl)...)
Show SMILES OC(=O)Cc1sc(nc1-c1ccc(F)cc1)N(c1ccc(F)cc1)c1ccc(F)cc1
Show InChI InChI=1S/C23H15F3N2O2S/c24-15-3-1-14(2-4-15)22-20(13-21(29)30)31-23(27-22)28(18-9-5-16(25)6-10-18)19-11-7-17(26)8-12-19/h1-12H,13H2,(H,29,30)
Reactome pathway
n/an/a 23n/an/an/an/an/an/a
7TM Pharma A/S
Curated by ChEMBL
Assay Description
Displacement of [3H]PGD2 from human CRTH2 receptor expressed in HEK385-7 cells
Bioorg Med Chem Lett 20: 1638-41 (2010)
Article DOI: 10.1016/j.bmcl.2010.01.092
BindingDB Entry DOI: 10.7270/Q2416X6B