BDBM50312913 2-(2-((4-cyanophenyl)(phenyl)amino)-4-(4-fluorophenyl)thiazol-5-yl)acetic acid::CHEMBL1087500
SMILES: OC(=O)Cc1sc(nc1-c1ccc(F)cc1)N(c1ccccc1)c1ccc(cc1)C#N
InChI Key: InChIKey=ZSEFTYXIDLEBRK-UHFFFAOYSA-N
Data: 2 IC50
Activity Spreadsheet -- Enzyme Inhibition Constant Data from BindingDB
Found 2 hits for monomerid = 50312913
Trg + Lig
Ki
nM
ΔG°
kcal/mole
IC50
nM
Kd
nM
EC50/IC50
nM
koff
s-1
kon
M-1s-1
pHTemp
°C
G protein-coupled receptor 44
(Homo sapiens (Human))
BDBM50312913
(2-(2-((4-cyanophenyl)(phenyl)amino)-4-(4-fluorophe...)
Show SMILES OC(=O)Cc1sc(nc1-c1ccc(F)cc1)N(c1ccccc1)c1ccc(cc1)C#N
Show InChI InChI=1S/C24H16FN3O2S/c25-18-10-8-17(9-11-18)23-21(14-22(29)30)31-24(27-23)28(19-4-2-1-3-5-19)20-12-6-16(15-26)7-13-20/h1-13H,14H2,(H,29,30)
Reactome pathway
n/an/a 0.460n/an/an/an/an/an/a
7TM Pharma A/S
Curated by ChEMBL
Assay Description
Antagonist activity at human CRTH2 receptor expressed in HEK385-7 cells assessed as inhibition of PGD2-mediated beta-arrestin translocation preincuba...
Bioorg Med Chem Lett 20: 1638-41 (2010)
Article DOI: 10.1016/j.bmcl.2010.01.092
BindingDB Entry DOI: 10.7270/Q2416X6B
G protein-coupled receptor 44
(Homo sapiens (Human))
BDBM50312913
(2-(2-((4-cyanophenyl)(phenyl)amino)-4-(4-fluorophe...)
Show SMILES OC(=O)Cc1sc(nc1-c1ccc(F)cc1)N(c1ccccc1)c1ccc(cc1)C#N
Show InChI InChI=1S/C24H16FN3O2S/c25-18-10-8-17(9-11-18)23-21(14-22(29)30)31-24(27-23)28(19-4-2-1-3-5-19)20-12-6-16(15-26)7-13-20/h1-13H,14H2,(H,29,30)
Reactome pathway
n/an/a 84n/an/an/an/an/an/a
7TM Pharma A/S
Curated by ChEMBL
Assay Description
Displacement of [3H]PGD2 from human CRTH2 receptor expressed in HEK385-7 cells
Bioorg Med Chem Lett 20: 1638-41 (2010)
Article DOI: 10.1016/j.bmcl.2010.01.092
BindingDB Entry DOI: 10.7270/Q2416X6B