BDBM50312988 (2-methyl-4-(2-(4-(4-methylpiperazin-1-yl)phenylamino)benzo[d]oxazol-7-yl)phenyl)(morpholino)methanone::CHEMBL1082023
SMILES: CN1CCN(CC1)c1ccc(Nc2nc3cccc(-c4ccc(C(=O)N5CCOCC5)c(C)c4)c3o2)cc1
InChI Key: InChIKey=LFIZDKRIFIBADR-UHFFFAOYSA-N
Data: 4 IC50
Activity Spreadsheet -- Enzyme Inhibition Constant Data from BindingDB
Found 4 hits for monomerid = 50312988
Trg + Lig
Ki
nM
ΔG°
kcal/mole
IC50
nM
Kd
nM
EC50/IC50
nM
koff
s-1
kon
M-1s-1
pHTemp
°C
Tyrosine-protein kinase JAK2
(Homo sapiens (Human))
BDBM50312988
((2-methyl-4-(2-(4-(4-methylpiperazin-1-yl)phenylam...)
Show SMILES CN1CCN(CC1)c1ccc(Nc2nc3cccc(-c4ccc(C(=O)N5CCOCC5)c(C)c4)c3o2)cc1
Show InChI InChI=1S/C30H33N5O3/c1-21-20-22(6-11-25(21)29(36)35-16-18-37-19-17-35)26-4-3-5-27-28(26)38-30(32-27)31-23-7-9-24(10-8-23)34-14-12-33(2)13-15-34/h3-11,20H,12-19H2,1-2H3,(H,31,32)
Reactome pathway
n/an/a 8n/an/an/an/an/an/a
Novartis Institutes for BioMedical Research
Curated by ChEMBL
Assay Description
Inhibition of GST-tagged JAK2 assessed as inhibition of biotinylated JAK3tide peptide phosphorylation after 60 mins by caliper mobility shift assay
Bioorg Med Chem Lett 20: 1724-7 (2010)
Article DOI: 10.1016/j.bmcl.2010.01.069
BindingDB Entry DOI: 10.7270/Q2M32VW0
Non-receptor tyrosine-protein kinase TYK2
(Homo sapiens (Human))
BDBM50312988
((2-methyl-4-(2-(4-(4-methylpiperazin-1-yl)phenylam...)
Show SMILES CN1CCN(CC1)c1ccc(Nc2nc3cccc(-c4ccc(C(=O)N5CCOCC5)c(C)c4)c3o2)cc1
Show InChI InChI=1S/C30H33N5O3/c1-21-20-22(6-11-25(21)29(36)35-16-18-37-19-17-35)26-4-3-5-27-28(26)38-30(32-27)31-23-7-9-24(10-8-23)34-14-12-33(2)13-15-34/h3-11,20H,12-19H2,1-2H3,(H,31,32)
n/an/a 300n/an/an/an/an/an/a
Novartis Institutes for BioMedical Research
Curated by ChEMBL
Assay Description
Inhibition of GST-tagged TYK2 assessed as inhibition of biotinylated IRS1 substrate phosphorylation after 60 mins by caliper mobility shift assay
Bioorg Med Chem Lett 20: 1724-7 (2010)
Article DOI: 10.1016/j.bmcl.2010.01.069
BindingDB Entry DOI: 10.7270/Q2M32VW0
Tyrosine-protein kinase JAK3
(Homo sapiens (Human))
BDBM50312988
((2-methyl-4-(2-(4-(4-methylpiperazin-1-yl)phenylam...)
Show SMILES CN1CCN(CC1)c1ccc(Nc2nc3cccc(-c4ccc(C(=O)N5CCOCC5)c(C)c4)c3o2)cc1
Show InChI InChI=1S/C30H33N5O3/c1-21-20-22(6-11-25(21)29(36)35-16-18-37-19-17-35)26-4-3-5-27-28(26)38-30(32-27)31-23-7-9-24(10-8-23)34-14-12-33(2)13-15-34/h3-11,20H,12-19H2,1-2H3,(H,31,32)
Reactome pathway
n/an/a 170n/an/an/an/an/an/a
Novartis Institutes for BioMedical Research
Curated by ChEMBL
Assay Description
Inhibition of GST-tagged JAK3 assessed as inhibition of biotinylated JAK3tide peptide phosphorylation after 60 mins by caliper mobility shift assay
Bioorg Med Chem Lett 20: 1724-7 (2010)
Article DOI: 10.1016/j.bmcl.2010.01.069
BindingDB Entry DOI: 10.7270/Q2M32VW0
Tyrosine-protein kinase JAK1
(Homo sapiens (Human))
BDBM50312988
((2-methyl-4-(2-(4-(4-methylpiperazin-1-yl)phenylam...)
Show SMILES CN1CCN(CC1)c1ccc(Nc2nc3cccc(-c4ccc(C(=O)N5CCOCC5)c(C)c4)c3o2)cc1
Show InChI InChI=1S/C30H33N5O3/c1-21-20-22(6-11-25(21)29(36)35-16-18-37-19-17-35)26-4-3-5-27-28(26)38-30(32-27)31-23-7-9-24(10-8-23)34-14-12-33(2)13-15-34/h3-11,20H,12-19H2,1-2H3,(H,31,32)
Reactome pathway
n/an/a 67n/an/an/an/an/an/a
Novartis Institutes for BioMedical Research
Curated by ChEMBL
Assay Description
Inhibition of GST-tagged JAK1 assessed as inhibition of biotinylated IRS1 substrate phosphorylation after 60 mins by caliper mobility shift assay
Bioorg Med Chem Lett 20: 1724-7 (2010)
Article DOI: 10.1016/j.bmcl.2010.01.069
BindingDB Entry DOI: 10.7270/Q2M32VW0