BDBM50312991 3-(1-methyl-1H-indol-3-yl)-4-morpholino-1H-pyrrole-2,5-dione::CHEMBL1080932
SMILES: Cn1cc(C2=C(N3CCOCC3)C(=O)NC2=O)c2ccccc12
InChI Key: InChIKey=OOVOLEKZFUHXFK-UHFFFAOYSA-N
Data: 1 IC50
Activity Spreadsheet -- Enzyme Inhibition Constant Data from BindingDB
Found 1 hit for monomerid = 50312991
Trg + Lig
Ki
nM
ΔG°
kcal/mole
IC50
nM
Kd
nM
EC50/IC50
nM
koff
s-1
kon
M-1s-1
pHTemp
°C
Glycogen synthase kinase-3 beta
(Homo sapiens (Human))
BDBM50312991
(3-(1-methyl-1H-indol-3-yl)-4-morpholino-1H-pyrrole...)
Show SMILES Cn1cc(C2=C(N3CCOCC3)C(=O)NC2=O)c2ccccc12 |c:4|
Show InChI InChI=1S/C17H17N3O3/c1-19-10-12(11-4-2-3-5-13(11)19)14-15(17(22)18-16(14)21)20-6-8-23-9-7-20/h2-5,10H,6-9H2,1H3,(H,18,21,22)
NCI pathway
Reactome pathway
n/an/a 8.20E+3n/an/an/an/an/an/a
Roche Palo Alto
Curated by ChEMBL
Assay Description
Inhibition of human recombinant GSK3-beta assessed as [gamma33]ATP transfer to biotinylated CREB-peptide substrate after 1 hr by scintillation counti...
Bioorg Med Chem Lett 20: 1693-6 (2010)
Article DOI: 10.1016/j.bmcl.2010.01.038
BindingDB Entry DOI: 10.7270/Q2ZK5HNS