BDBM50313318 CHEMBL1081268::N-(4-hydroxyphenyl)-6-(o-tolylamino)pyrimidine-4-carboxamide::US9150519, 1-20
SMILES: Cc1ccccc1Nc1cc(ncn1)C(=O)Nc1ccc(O)cc1
InChI Key: InChIKey=CQKLVBPHLDZQRV-UHFFFAOYSA-N
Data: 1 KI  2 EC50
Activity Spreadsheet -- Enzyme Inhibition Constant Data from BindingDB
Found 3 hits for monomerid = 50313318
Trg + Lig
Ki
nM
ΔG°
kcal/mole
IC50
nM
Kd
nM
EC50/IC50
nM
koff
s-1
kon
M-1s-1
pHTemp
°C
Sphingosine 1-phosphate receptor 1
(Homo sapiens (Human))
BDBM50313318
(CHEMBL1081268 | N-(4-hydroxyphenyl)-6-(o-tolylamin...)
Show SMILES Cc1ccccc1Nc1cc(ncn1)C(=O)Nc1ccc(O)cc1
Show InChI InChI=1S/C18H16N4O2/c1-12-4-2-3-5-15(12)22-17-10-16(19-11-20-17)18(24)21-13-6-8-14(23)9-7-13/h2-11,23H,1H3,(H,21,24)(H,19,20,22)
Reactome pathway
US Patent
840 -7.70n/an/an/an/an/a7.44
MERCK SERONO SA
US Patent
Assay Description
Membranes were prepared from CHO cells expressing S1P1 or S1P3 for use in ligand and 35S-GTPgammaS binding studies. Cells were suspended in 50 mM TRI...
US Patent US9150519 (2015)
BindingDB Entry DOI: 10.7270/Q2H993ZK
Sphingosine 1-phosphate receptor 1
(Homo sapiens (Human))
BDBM50313318
(CHEMBL1081268 | N-(4-hydroxyphenyl)-6-(o-tolylamin...)
Show SMILES Cc1ccccc1Nc1cc(ncn1)C(=O)Nc1ccc(O)cc1
Show InChI InChI=1S/C18H16N4O2/c1-12-4-2-3-5-15(12)22-17-10-16(19-11-20-17)18(24)21-13-6-8-14(23)9-7-13/h2-11,23H,1H3,(H,21,24)(H,19,20,22)
Reactome pathway
n/an/an/an/a 2.10E+3n/an/an/an/a
Merck Serono SA
Curated by ChEMBL
Assay Description
Agonist activity at S1P1 receptor expressed in CHO cells after 60 mins by [35S]-GTPgammaS binding assay
Bioorg Med Chem Lett 20: 1516-9 (2010)
Article DOI: 10.1016/j.bmcl.2010.01.102
BindingDB Entry DOI: 10.7270/Q2J38SQK
Sphingosine 1-phosphate receptor 1
(Homo sapiens (Human))
BDBM50313318
(CHEMBL1081268 | N-(4-hydroxyphenyl)-6-(o-tolylamin...)
Show SMILES Cc1ccccc1Nc1cc(ncn1)C(=O)Nc1ccc(O)cc1
Show InChI InChI=1S/C18H16N4O2/c1-12-4-2-3-5-15(12)22-17-10-16(19-11-20-17)18(24)21-13-6-8-14(23)9-7-13/h2-11,23H,1H3,(H,21,24)(H,19,20,22)
Reactome pathway
US Patent
n/an/an/an/a 2.10E+3n/an/a7.430
MERCK SERONO SA
US Patent
Assay Description
Measurements of 35S-GTPgammaS Binding: Membranes (1 to 10 µg protein) prepared as described above, were incubated in 96-well Scintiplates (PerkinElm...
US Patent US9150519 (2015)
BindingDB Entry DOI: 10.7270/Q2H993ZK