BDBM50313321 6-(cyclohexyl(methyl)amino)-N-(4-hydroxy-2-methylphenyl)pyrimidine-4-carboxamide::CHEMBL1081271::US9150519, 1-21
SMILES: CN(C1CCCCC1)c1cc(ncn1)C(=O)Nc1ccc(O)cc1C
InChI Key: InChIKey=FNJQXCOVHUVDTB-UHFFFAOYSA-N
Data: 2 EC50
Activity Spreadsheet -- Enzyme Inhibition Constant Data from BindingDB
Found 2 hits for monomerid = 50313321
Trg + Lig
Ki
nM
ΔG°
kcal/mole
IC50
nM
Kd
nM
EC50/IC50
nM
koff
s-1
kon
M-1s-1
pHTemp
°C
Sphingosine 1-phosphate receptor 1
(Homo sapiens (Human))
BDBM50313321
(6-(cyclohexyl(methyl)amino)-N-(4-hydroxy-2-methylp...)
Show SMILES CN(C1CCCCC1)c1cc(ncn1)C(=O)Nc1ccc(O)cc1C
Show InChI InChI=1S/C19H24N4O2/c1-13-10-15(24)8-9-16(13)22-19(25)17-11-18(21-12-20-17)23(2)14-6-4-3-5-7-14/h8-12,14,24H,3-7H2,1-2H3,(H,22,25)
Reactome pathway
n/an/an/an/a 655n/an/an/an/a
Merck Serono SA
Curated by ChEMBL
Assay Description
Agonist activity at S1P1 receptor expressed in CHO cells after 60 mins by [35S]-GTPgammaS binding assay
Bioorg Med Chem Lett 20: 1516-9 (2010)
Article DOI: 10.1016/j.bmcl.2010.01.102
BindingDB Entry DOI: 10.7270/Q2J38SQK
Sphingosine 1-phosphate receptor 1
(Homo sapiens (Human))
BDBM50313321
(6-(cyclohexyl(methyl)amino)-N-(4-hydroxy-2-methylp...)
Show SMILES CN(C1CCCCC1)c1cc(ncn1)C(=O)Nc1ccc(O)cc1C
Show InChI InChI=1S/C19H24N4O2/c1-13-10-15(24)8-9-16(13)22-19(25)17-11-18(21-12-20-17)23(2)14-6-4-3-5-7-14/h8-12,14,24H,3-7H2,1-2H3,(H,22,25)
Reactome pathway
US Patent
n/an/an/an/a 660n/an/a7.430
MERCK SERONO SA
US Patent
Assay Description
Measurements of 35S-GTPgammaS Binding: Membranes (1 to 10 µg protein) prepared as described above, were incubated in 96-well Scintiplates (PerkinElm...
US Patent US9150519 (2015)
BindingDB Entry DOI: 10.7270/Q2H993ZK