BDBM50313380 (2S,3R,4S,5S,6R)-2-(3-(4-ethylbenzyl)-4-methylphenyl)-6-(hydroxymethyl)tetrahydro-2H-pyran-3,4,5-triol::CHEMBL1082892
SMILES: CCc1ccc(Cc2cc(ccc2C)[C@@H]2O[C@H](CO)[C@@H](O)[C@@H](O)[C@H]2O)cc1
InChI Key: InChIKey=IOUMMDDMHYSAMP-LMYCIYFBSA-N
Data: 1 IC50
Activity Spreadsheet -- Enzyme Inhibition Constant Data from BindingDB
Found 1 hit for monomerid = 50313380
Trg + Lig
Ki
nM
ΔG°
kcal/mole
IC50
nM
Kd
nM
EC50/IC50
nM
koff
s-1
kon
M-1s-1
pHTemp
°C
Sodium/glucose cotransporter 2
(Homo sapiens (Human))
BDBM50313380
((2S,3R,4S,5S,6R)-2-(3-(4-ethylbenzyl)-4-methylphen...)
Show SMILES CCc1ccc(Cc2cc(ccc2C)[C@@H]2O[C@H](CO)[C@@H](O)[C@@H](O)[C@H]2O)cc1 |r|
Show InChI InChI=1S/C22H28O5/c1-3-14-5-7-15(8-6-14)10-17-11-16(9-4-13(17)2)22-21(26)20(25)19(24)18(12-23)27-22/h4-9,11,18-26H,3,10,12H2,1-2H3/t18-,19-,20-,21-,22+/m1/s1
n/an/a 3.70E+3n/an/an/an/an/an/a
Pfizer Global Research& Development
Curated by ChEMBL
Assay Description
Inhibition of human SGLT2 expressed in CHO cells assessed as inhibition of sodium-dependent methyl-alpha-D-[U-14C]glucopyranoside uptake after 2 hrs
Bioorg Med Chem Lett 20: 1569-72 (2010)
Article DOI: 10.1016/j.bmcl.2010.01.075
BindingDB Entry DOI: 10.7270/Q2DF6RBP