BDBM50313407 4-((4aS,5R,10bS)-9-tert-butyl-3,4,4a,5,6,10b-hexahydro-2H-pyrano[3,2-c]quinolin-5-yl)phenol::CHEMBL1078691
SMILES: CC(C)(C)c1ccc2N[C@H]([C@@H]3CCCO[C@@H]3c2c1)c1ccc(O)cc1
InChI Key: InChIKey=HWBHNMJNAWDWGG-YYWHXJBOSA-N
Data: 1 IC50
Activity Spreadsheet -- Enzyme Inhibition Constant Data from BindingDB
Found 1 hit for monomerid = 50313407
Trg + Lig
Ki
nM
ΔG°
kcal/mole
IC50
nM
Kd
nM
EC50/IC50
nM
koff
s-1
kon
M-1s-1
pHTemp
°C
Kinesin-like protein 1
(Homo sapiens (Human))
BDBM50313407
(4-((4aS,5R,10bS)-9-tert-butyl-3,4,4a,5,6,10b-hexah...)
Show SMILES CC(C)(C)c1ccc2N[C@H]([C@@H]3CCCO[C@@H]3c2c1)c1ccc(O)cc1 |r|
Show InChI InChI=1S/C22H27NO2/c1-22(2,3)15-8-11-19-18(13-15)21-17(5-4-12-25-21)20(23-19)14-6-9-16(24)10-7-14/h6-11,13,17,20-21,23-24H,4-5,12H2,1-3H3/t17-,20-,21-/m0/s1
Reactome pathway
n/an/a 34n/an/an/an/an/an/a
Merck Serono
Curated by ChEMBL
Assay Description
Inhibition of ATPase activity of human recombinant EG5 assessed as ATP hydrolysis by pyruvate kinase-lactate dehydrogenase coupled assay
Bioorg Med Chem Lett 20: 1491-5 (2010)
Article DOI: 10.1016/j.bmcl.2010.01.110
BindingDB Entry DOI: 10.7270/Q2KD1ZWN