BDBM50313419 (4aS,5R,10bS)-9-tert-butyl-5-(thiophen-3-yl)-3,4,4a,5,6,10b-hexahydro-2H-pyrano[3,2-c]quinoline::CHEMBL1084115
SMILES: CC(C)(C)c1ccc2N[C@H]([C@@H]3CCCO[C@@H]3c2c1)c1ccsc1
InChI Key: InChIKey=ZGVZXPRTLYOKED-SNRMKQJTSA-N
Data: 1 IC50
Activity Spreadsheet -- Enzyme Inhibition Constant Data from BindingDB
Found 1 hit for monomerid = 50313419
Trg + Lig
Ki
nM
ΔG°
kcal/mole
IC50
nM
Kd
nM
EC50/IC50
nM
koff
s-1
kon
M-1s-1
pHTemp
°C
Kinesin-like protein 1
(Homo sapiens (Human))
BDBM50313419
((4aS,5R,10bS)-9-tert-butyl-5-(thiophen-3-yl)-3,4,4...)
Show SMILES CC(C)(C)c1ccc2N[C@H]([C@@H]3CCCO[C@@H]3c2c1)c1ccsc1 |r|
Show InChI InChI=1S/C20H25NOS/c1-20(2,3)14-6-7-17-16(11-14)19-15(5-4-9-22-19)18(21-17)13-8-10-23-12-13/h6-8,10-12,15,18-19,21H,4-5,9H2,1-3H3/t15-,18-,19-/m0/s1
Reactome pathway
n/an/a 120n/an/an/an/an/an/a
Merck Serono
Curated by ChEMBL
Assay Description
Inhibition of ATPase activity of human recombinant EG5 assessed as ATP hydrolysis by pyruvate kinase-lactate dehydrogenase coupled assay
Bioorg Med Chem Lett 20: 1491-5 (2010)
Article DOI: 10.1016/j.bmcl.2010.01.110
BindingDB Entry DOI: 10.7270/Q2KD1ZWN