BDBM50313427 1-(3-hydroxypropyl)-3-(((2R,4aS,5R,10bS)-5-phenyl-9-(trifluoromethyl)-3,4,4a,5,6,10b-hexahydro-2H-pyrano[3,2-c]quinolin-2-yl)methyl)urea::CHEMBL1085895
SMILES: OCCCNC(=O)NC[C@H]1CC[C@H]2[C@@H](Nc3ccc(cc3[C@H]2O1)C(F)(F)F)c1ccccc1
InChI Key: InChIKey=FDLZKAHBFBTSIT-KSCDAYEDSA-N
Data: 1 IC50
Activity Spreadsheet -- Enzyme Inhibition Constant Data from BindingDB
Found 1 hit for monomerid = 50313427
Trg + Lig
Ki
nM
ΔG°
kcal/mole
IC50
nM
Kd
nM
EC50/IC50
nM
koff
s-1
kon
M-1s-1
pHTemp
°C
Kinesin-like protein 1
(Homo sapiens (Human))
BDBM50313427
(1-(3-hydroxypropyl)-3-(((2R,4aS,5R,10bS)-5-phenyl-...)
Show SMILES OCCCNC(=O)NC[C@H]1CC[C@H]2[C@@H](Nc3ccc(cc3[C@H]2O1)C(F)(F)F)c1ccccc1 |r|
Show InChI InChI=1S/C24H28F3N3O3/c25-24(26,27)16-7-10-20-19(13-16)22-18(21(30-20)15-5-2-1-3-6-15)9-8-17(33-22)14-29-23(32)28-11-4-12-31/h1-3,5-7,10,13,17-18,21-22,30-31H,4,8-9,11-12,14H2,(H2,28,29,32)/t17-,18+,21+,22+/m1/s1
Reactome pathway
n/an/a 11n/an/an/an/an/an/a
Merck Serono
Curated by ChEMBL
Assay Description
Inhibition of ATPase activity of human recombinant EG5 assessed as ATP hydrolysis by pyruvate kinase-lactate dehydrogenase coupled assay
Bioorg Med Chem Lett 20: 1491-5 (2010)
Article DOI: 10.1016/j.bmcl.2010.01.110
BindingDB Entry DOI: 10.7270/Q2KD1ZWN