BDBM50313440 1-((2R,4aS,5R,10bS)-9-cyclopropyl-5-phenyl-3,4,4a,5,6,10b-hexahydro-2H-pyrano[3,2-c]quinolin-2-yl)-N-methylmethanamine::CHEMBL1083836
SMILES: CNC[C@H]1CC[C@H]2[C@@H](Nc3ccc(cc3[C@H]2O1)C1CC1)c1ccccc1
InChI Key: InChIKey=QQEWASHPOIZWPU-FUKQBSRTSA-N
Data: 1 IC50
Activity Spreadsheet -- Enzyme Inhibition Constant Data from BindingDB
Found 1 hit for monomerid = 50313440
Trg + Lig
Ki
nM
ΔG°
kcal/mole
IC50
nM
Kd
nM
EC50/IC50
nM
koff
s-1
kon
M-1s-1
pHTemp
°C
Kinesin-like protein 1
(Homo sapiens (Human))
BDBM50313440
(1-((2R,4aS,5R,10bS)-9-cyclopropyl-5-phenyl-3,4,4a,...)
Show SMILES CNC[C@H]1CC[C@H]2[C@@H](Nc3ccc(cc3[C@H]2O1)C1CC1)c1ccccc1 |r|
Show InChI InChI=1S/C23H28N2O/c1-24-14-18-10-11-19-22(16-5-3-2-4-6-16)25-21-12-9-17(15-7-8-15)13-20(21)23(19)26-18/h2-6,9,12-13,15,18-19,22-25H,7-8,10-11,14H2,1H3/t18-,19+,22+,23+/m1/s1
Reactome pathway
n/an/a 11n/an/an/an/an/an/a
Merck Serono
Curated by ChEMBL
Assay Description
Inhibition of ATPase activity of human recombinant EG5 assessed as ATP hydrolysis by pyruvate kinase-lactate dehydrogenase coupled assay
Bioorg Med Chem Lett 20: 1491-5 (2010)
Article DOI: 10.1016/j.bmcl.2010.01.110
BindingDB Entry DOI: 10.7270/Q2KD1ZWN