BDBM50313625 1-((2R,3S,4R)-4-((R)-1-(3,5-bis(trifluoromethyl)phenyl)ethoxy)-3-(4-fluorophenyl)-2-(hydroxymethyl)pyrrolidin-1-yl)ethanone::CHEMBL1085196
SMILES: C[C@@H](O[C@H]1CN([C@@H](CO)[C@@H]1c1ccc(F)cc1)C(C)=O)c1cc(cc(c1)C(F)(F)F)C(F)(F)F
InChI Key: InChIKey=XJRHWGMMLUJUMV-DDEZQWHHSA-N
Data: 2 IC50
Activity Spreadsheet -- Enzyme Inhibition Constant Data from BindingDB
Found 2 hits for monomerid = 50313625
Trg + Lig
Ki
nM
ΔG°
kcal/mole
IC50
nM
Kd
nM
EC50/IC50
nM
koff
s-1
kon
M-1s-1
pHTemp
°C
Neurokinin 1 receptor
(Homo sapiens (Human))
BDBM50313625
(1-((2R,3S,4R)-4-((R)-1-(3,5-bis(trifluoromethyl)ph...)
Show SMILES C[C@@H](O[C@H]1CN([C@@H](CO)[C@@H]1c1ccc(F)cc1)C(C)=O)c1cc(cc(c1)C(F)(F)F)C(F)(F)F |r|
Show InChI InChI=1S/C23H22F7NO3/c1-12(15-7-16(22(25,26)27)9-17(8-15)23(28,29)30)34-20-10-31(13(2)33)19(11-32)21(20)14-3-5-18(24)6-4-14/h3-9,12,19-21,32H,10-11H2,1-2H3/t12-,19+,20+,21+/m1/s1
Reactome pathway
n/an/a 43.1n/an/an/an/an/an/a
Merck Research Laboratories
Curated by ChEMBL
Assay Description
Displacement of [125I]substance P from human NK1 receptor expressed in CHO cells in the presence of 50 percent human serum
Bioorg Med Chem Lett 20: 2007-12 (2010)
Article DOI: 10.1016/j.bmcl.2010.01.065
BindingDB Entry DOI: 10.7270/Q23X86SP
Neurokinin 1 receptor
(Homo sapiens (Human))
BDBM50313625
(1-((2R,3S,4R)-4-((R)-1-(3,5-bis(trifluoromethyl)ph...)
Show SMILES C[C@@H](O[C@H]1CN([C@@H](CO)[C@@H]1c1ccc(F)cc1)C(C)=O)c1cc(cc(c1)C(F)(F)F)C(F)(F)F |r|
Show InChI InChI=1S/C23H22F7NO3/c1-12(15-7-16(22(25,26)27)9-17(8-15)23(28,29)30)34-20-10-31(13(2)33)19(11-32)21(20)14-3-5-18(24)6-4-14/h3-9,12,19-21,32H,10-11H2,1-2H3/t12-,19+,20+,21+/m1/s1
Reactome pathway
n/an/a 0.300n/an/an/an/an/an/a
Merck Research Laboratories
Curated by ChEMBL
Assay Description
Displacement of [125I]substance P from human NK1 receptor expressed in CHO cells
Bioorg Med Chem Lett 20: 2007-12 (2010)
Article DOI: 10.1016/j.bmcl.2010.01.065
BindingDB Entry DOI: 10.7270/Q23X86SP