BDBM50313696 CHEMBL1086427::N-(6-chloro-7-fluoro-5-phenyl-1H-indazol-3-yl)butyramide
SMILES: CCCC(=O)Nc1n[nH]c2c(F)c(Cl)c(cc12)-c1ccccc1
InChI Key: InChIKey=PREQLWGLUIHGJV-UHFFFAOYSA-N
Data: 4 IC50
Activity Spreadsheet -- Enzyme Inhibition Constant Data from BindingDB
Found 4 hits for monomerid = 50313696
Trg + Lig
Ki
nM
ΔG°
kcal/mole
IC50
nM
Kd
nM
EC50/IC50
nM
koff
s-1
kon
M-1s-1
pHTemp
°C
Cyclin-dependent kinase 1
(Homo sapiens (Human))
BDBM50313696
(CHEMBL1086427 | N-(6-chloro-7-fluoro-5-phenyl-1H-i...)
Show SMILES CCCC(=O)Nc1n[nH]c2c(F)c(Cl)c(cc12)-c1ccccc1
Show InChI InChI=1S/C17H15ClFN3O/c1-2-6-13(23)20-17-12-9-11(10-7-4-3-5-8-10)14(18)15(19)16(12)21-22-17/h3-5,7-9H,2,6H2,1H3,(H2,20,21,22,23)
Reactome pathway
n/an/a 2.50E+3n/an/an/an/an/an/a
Sanofi-aventis
Curated by ChEMBL
Assay Description
Inhibition of Cdk1
Bioorg Med Chem Lett 20: 1985-9 (2010)
Article DOI: 10.1016/j.bmcl.2010.01.114
BindingDB Entry DOI: 10.7270/Q2QN66XJ
Cyclin-dependent kinase 2
(Homo sapiens (Human))
BDBM50313696
(CHEMBL1086427 | N-(6-chloro-7-fluoro-5-phenyl-1H-i...)
Show SMILES CCCC(=O)Nc1n[nH]c2c(F)c(Cl)c(cc12)-c1ccccc1
Show InChI InChI=1S/C17H15ClFN3O/c1-2-6-13(23)20-17-12-9-11(10-7-4-3-5-8-10)14(18)15(19)16(12)21-22-17/h3-5,7-9H,2,6H2,1H3,(H2,20,21,22,23)
NCI pathway
Reactome pathway
n/an/a 3.16E+3n/an/an/an/an/an/a
Sanofi-aventis
Curated by ChEMBL
Assay Description
Inhibition of Cdk2
Bioorg Med Chem Lett 20: 1985-9 (2010)
Article DOI: 10.1016/j.bmcl.2010.01.114
BindingDB Entry DOI: 10.7270/Q2QN66XJ
Microtubule-associated protein tau
(Rattus norvegicus)
BDBM50313696
(CHEMBL1086427 | N-(6-chloro-7-fluoro-5-phenyl-1H-i...)
Show SMILES CCCC(=O)Nc1n[nH]c2c(F)c(Cl)c(cc12)-c1ccccc1
Show InChI InChI=1S/C17H15ClFN3O/c1-2-6-13(23)20-17-12-9-11(10-7-4-3-5-8-10)14(18)15(19)16(12)21-22-17/h3-5,7-9H,2,6H2,1H3,(H2,20,21,22,23)
n/an/a 250n/an/an/an/an/an/a
Sanofi-aventis
Curated by ChEMBL
Assay Description
Inhibition of Tau phosphorylation in rat cerebral cortex after 120 mins by chemiluminescence assay
Bioorg Med Chem Lett 20: 1985-9 (2010)
Article DOI: 10.1016/j.bmcl.2010.01.114
BindingDB Entry DOI: 10.7270/Q2QN66XJ
Glycogen synthase kinase-3 beta
(Homo sapiens (Human))
BDBM50313696
(CHEMBL1086427 | N-(6-chloro-7-fluoro-5-phenyl-1H-i...)
Show SMILES CCCC(=O)Nc1n[nH]c2c(F)c(Cl)c(cc12)-c1ccccc1
Show InChI InChI=1S/C17H15ClFN3O/c1-2-6-13(23)20-17-12-9-11(10-7-4-3-5-8-10)14(18)15(19)16(12)21-22-17/h3-5,7-9H,2,6H2,1H3,(H2,20,21,22,23)
NCI pathway
Reactome pathway
n/an/a 6n/an/an/an/an/an/a
Sanofi-aventis
Curated by ChEMBL
Assay Description
Inhibition of human recombinant GSK3-beta using gamma[33P]-ATP after 30 mins by scintillation proximity assay
Bioorg Med Chem Lett 20: 1985-9 (2010)
Article DOI: 10.1016/j.bmcl.2010.01.114
BindingDB Entry DOI: 10.7270/Q2QN66XJ