BDBM50314053 CHEMBL1092827::N-(3-(2-(piperazin-1-yl)pyrazolo[1,5-a]pyrimidin-7-yl)phenyl)-3-(trifluoromethyl)benzamide
SMILES: FC(F)(F)c1cccc(c1)C(=O)Nc1cccc(c1)-c1ccnc2cc(nn12)N1CCNCC1
InChI Key: InChIKey=BYYUAHCUHJMTHJ-UHFFFAOYSA-N
Data: 1 IC50
Activity Spreadsheet -- Enzyme Inhibition Constant Data from BindingDB
Found 1 hit for monomerid = 50314053
Trg + Lig
Ki
nM
ΔG°
kcal/mole
IC50
nM
Kd
nM
EC50/IC50
nM
koff
s-1
kon
M-1s-1
pHTemp
°C
Serine/threonine-protein kinase B-raf
(Homo sapiens (Human))
BDBM50314053
(CHEMBL1092827 | N-(3-(2-(piperazin-1-yl)pyrazolo[1...)
Show SMILES FC(F)(F)c1cccc(c1)C(=O)Nc1cccc(c1)-c1ccnc2cc(nn12)N1CCNCC1
Show InChI InChI=1S/C24H21F3N6O/c25-24(26,27)18-5-1-4-17(13-18)23(34)30-19-6-2-3-16(14-19)20-7-8-29-21-15-22(31-33(20)21)32-11-9-28-10-12-32/h1-8,13-15,28H,9-12H2,(H,30,34)
NCI pathway
Reactome pathway
n/an/a 6.20E+3n/an/an/an/an/an/a
Wyeth Research
Curated by ChEMBL
Assay Description
Inhibition of b-Raf
Bioorg Med Chem Lett 19: 6890-2 (2009)
Article DOI: 10.1016/j.bmcl.2009.10.074
BindingDB Entry DOI: 10.7270/Q2C829F3