BDBM50314072 5-(2,4-difluorophenoxy)-N-(2-(dimethylamino)ethyl)-1-isobutyl-1H-indazole-6-carboxamide::CHEMBL1088750
SMILES: CC(C)Cn1ncc2cc(Oc3ccc(F)cc3F)c(cc12)C(=O)NCCN(C)C
InChI Key: InChIKey=IFGWYHGYNVGVRB-UHFFFAOYSA-N
Data: 1 IC50
Activity Spreadsheet -- Enzyme Inhibition Constant Data from BindingDB
Found 1 hit for monomerid = 50314072
Trg + Lig
Ki
nM
ΔG°
kcal/mole
IC50
nM
Kd
nM
EC50/IC50
nM
koff
s-1
kon
M-1s-1
pHTemp
°C
Mitogen-activated protein kinase 14
(Homo sapiens (Human))
BDBM50314072
(5-(2,4-difluorophenoxy)-N-(2-(dimethylamino)ethyl)...)
Show SMILES CC(C)Cn1ncc2cc(Oc3ccc(F)cc3F)c(cc12)C(=O)NCCN(C)C
Show InChI InChI=1S/C22H26F2N4O2/c1-14(2)13-28-19-11-17(22(29)25-7-8-27(3)4)21(9-15(19)12-26-28)30-20-6-5-16(23)10-18(20)24/h5-6,9-12,14H,7-8,13H2,1-4H3,(H,25,29)
NCI pathway
Reactome pathway
n/an/a 4.5n/an/an/an/an/an/a
Roche Palo Alto
Curated by ChEMBL
Assay Description
Inhibition of human recombinant p38alpha by liquid scintillation counting
J Med Chem 53: 2345-53 (2010)
Article DOI: 10.1021/jm9012906
BindingDB Entry DOI: 10.7270/Q27H1JQC