BDBM50314118 CHEMBL1090402::N-(6-(2-chlorophenyl)-5-(4-chlorophenyl)-2-pivaloylfuro[2,3-b]pyridin-3-yl)acetamide
SMILES: CC(=O)Nc1c(oc2nc(-c3ccccc3Cl)c(cc12)-c1ccc(Cl)cc1)C(=O)C(C)(C)C
InChI Key: InChIKey=MEJPFDSDXIJBSI-UHFFFAOYSA-N
Data: 2 IC50
Activity Spreadsheet -- Enzyme Inhibition Constant Data from BindingDB
Found 2 hits for monomerid = 50314118
Trg + Lig
Ki
nM
ΔG°
kcal/mole
IC50
nM
Kd
nM
EC50/IC50
nM
koff
s-1
kon
M-1s-1
pHTemp
°C
Cannabinoid receptor 2
(Homo sapiens (Human))
BDBM50314118
(CHEMBL1090402 | N-(6-(2-chlorophenyl)-5-(4-chlorop...)
Show SMILES CC(=O)Nc1c(oc2nc(-c3ccccc3Cl)c(cc12)-c1ccc(Cl)cc1)C(=O)C(C)(C)C
Show InChI InChI=1S/C26H22Cl2N2O3/c1-14(31)29-22-19-13-18(15-9-11-16(27)12-10-15)21(17-7-5-6-8-20(17)28)30-25(19)33-23(22)24(32)26(2,3)4/h5-13H,1-4H3,(H,29,31)
Reactome pathway
n/an/a>2.00E+3n/an/an/an/an/an/a
Merck Research Laboratories
Curated by ChEMBL
Assay Description
Inhibition of human CB2 receptor
Bioorg Med Chem Lett 20: 1448-52 (2010)
Article DOI: 10.1016/j.bmcl.2009.12.065
BindingDB Entry DOI: 10.7270/Q2028RPD
Cannabinoid receptor 1
(Homo sapiens (Human))
BDBM50314118
(CHEMBL1090402 | N-(6-(2-chlorophenyl)-5-(4-chlorop...)
Show SMILES CC(=O)Nc1c(oc2nc(-c3ccccc3Cl)c(cc12)-c1ccc(Cl)cc1)C(=O)C(C)(C)C
Show InChI InChI=1S/C26H22Cl2N2O3/c1-14(31)29-22-19-13-18(15-9-11-16(27)12-10-15)21(17-7-5-6-8-20(17)28)30-25(19)33-23(22)24(32)26(2,3)4/h5-13H,1-4H3,(H,29,31)
NCI pathway
Reactome pathway
n/an/a 0.580n/an/an/an/an/an/a
Merck Research Laboratories
Curated by ChEMBL
Assay Description
Inhibition of human CB1 receptor
Bioorg Med Chem Lett 20: 1448-52 (2010)
Article DOI: 10.1016/j.bmcl.2009.12.065
BindingDB Entry DOI: 10.7270/Q2028RPD