BDBM50314442 2-(furan-2-yl)-10-thia-5,7,12-triazatetracyclo[11.7.0.0^{3,11}.0^{4,9}]icosa-1(13),2,4(9),5,7,11-hexaen-8-amine::CHEMBL1091450
SMILES: Nc1ncnc2c1sc1nc3CCCCCCCc3c(-c3ccco3)c21
InChI Key: InChIKey=WMISFEODCMGWDV-UHFFFAOYSA-N
Data: 1 IC50
Activity Spreadsheet -- Enzyme Inhibition Constant Data from BindingDB
Found 1 hit for monomerid = 50314442
Trg + Lig
Ki
nM
ΔG°
kcal/mole
IC50
nM
Kd
nM
EC50/IC50
nM
koff
s-1
kon
M-1s-1
pHTemp
°C
Eukaryotic elongation factor 2 kinase
(Homo sapiens (Human))
BDBM50314442
(2-(furan-2-yl)-10-thia-5,7,12-triazatetracyclo[11....)
Show SMILES Nc1ncnc2c1sc1nc3CCCCCCCc3c(-c3ccco3)c21
Show InChI InChI=1S/C20H20N4OS/c21-19-18-17(22-11-23-19)16-15(14-9-6-10-25-14)12-7-4-2-1-3-5-8-13(12)24-20(16)26-18/h6,9-11H,1-5,7-8H2,(H2,21,22,23)
Reactome pathway
n/an/a 350n/an/an/an/an/an/a
Myriad Pharmaceuticals
Curated by ChEMBL
Assay Description
Inhibition of GST tagged eEf2K expressed in Escherichia coli by fluorometric method
Bioorg Med Chem Lett 20: 2283-6 (2010)
Article DOI: 10.1016/j.bmcl.2010.02.005
BindingDB Entry DOI: 10.7270/Q2F18ZVT