BDBM50314765 CHEMBL1093305::trans-N-(2-((S)-1'-((3S,4R)-1-tert-butyl-4-(2,4-difluorophenyl)pyrrolidine-3-carbonyl)-6-chloro-5-methyl-2,3-dihydrospiro[indene-1,4'-piperidine]-3-yl)propan-2-yl)acetamide
SMILES: CC(=O)NC(C)(C)[C@H]1CC2(CCN(CC2)C(=O)[C@@H]2CN(C[C@H]2c2ccc(F)cc2F)C(C)(C)C)c2cc(Cl)c(C)cc12
InChI Key: InChIKey=KMNARKQYUZICHM-REUBFRLUSA-N
Data: 2 IC50  3 EC50
Activity Spreadsheet -- Enzyme Inhibition Constant Data from BindingDB
Found 5 hits for monomerid = 50314765
Trg + Lig
Ki
nM
ΔG°
kcal/mole
IC50
nM
Kd
nM
EC50/IC50
nM
koff
s-1
kon
M-1s-1
pHTemp
°C
Melanocortin receptor 4
(Homo sapiens (Human))
BDBM50314765
(CHEMBL1093305 | trans-N-(2-((S)-1'-((3S,4R)-1-tert...)
Show SMILES CC(=O)NC(C)(C)[C@H]1CC2(CCN(CC2)C(=O)[C@@H]2CN(C[C@H]2c2ccc(F)cc2F)C(C)(C)C)c2cc(Cl)c(C)cc12 |r|
Show InChI InChI=1S/C34H44ClF2N3O2/c1-20-14-24-27(16-29(20)35)34(17-28(24)33(6,7)38-21(2)41)10-12-39(13-11-34)31(42)26-19-40(32(3,4)5)18-25(26)23-9-8-22(36)15-30(23)37/h8-9,14-16,25-26,28H,10-13,17-19H2,1-7H3,(H,38,41)/t25-,26+,28-/m0/s1
n/an/an/an/a 3.20n/an/an/an/a
Merck Research Laboratories
Curated by ChEMBL
Assay Description
Agonist activity at human MC4R expressed in CHO cells assessed as stimulation of intracellular cAMP accumulation
Bioorg Med Chem Lett 20: 2106-10 (2010)
Article DOI: 10.1016/j.bmcl.2010.02.058
BindingDB Entry DOI: 10.7270/Q2QC03NP
Melanocortin receptor 4
(Homo sapiens (Human))
BDBM50314765
(CHEMBL1093305 | trans-N-(2-((S)-1'-((3S,4R)-1-tert...)
Show SMILES CC(=O)NC(C)(C)[C@H]1CC2(CCN(CC2)C(=O)[C@@H]2CN(C[C@H]2c2ccc(F)cc2F)C(C)(C)C)c2cc(Cl)c(C)cc12 |r|
Show InChI InChI=1S/C34H44ClF2N3O2/c1-20-14-24-27(16-29(20)35)34(17-28(24)33(6,7)38-21(2)41)10-12-39(13-11-34)31(42)26-19-40(32(3,4)5)18-25(26)23-9-8-22(36)15-30(23)37/h8-9,14-16,25-26,28H,10-13,17-19H2,1-7H3,(H,38,41)/t25-,26+,28-/m0/s1
n/an/an/an/a 3.30n/an/an/an/a
Merck Research Laboratories
Curated by ChEMBL
Assay Description
Agonist activity at human MC4R expressed in CHO cells assessed as increase of alpha-MSH-stimulated cAMP release pretreated for 10 mins before alpha-M...
Bioorg Med Chem Lett 20: 4399-405 (2010)
Article DOI: 10.1016/j.bmcl.2010.06.062
BindingDB Entry DOI: 10.7270/Q23F4Q07
Melanocortin receptor 4
(Homo sapiens (Human))
BDBM50314765
(CHEMBL1093305 | trans-N-(2-((S)-1'-((3S,4R)-1-tert...)
Show SMILES CC(=O)NC(C)(C)[C@H]1CC2(CCN(CC2)C(=O)[C@@H]2CN(C[C@H]2c2ccc(F)cc2F)C(C)(C)C)c2cc(Cl)c(C)cc12 |r|
Show InChI InChI=1S/C34H44ClF2N3O2/c1-20-14-24-27(16-29(20)35)34(17-28(24)33(6,7)38-21(2)41)10-12-39(13-11-34)31(42)26-19-40(32(3,4)5)18-25(26)23-9-8-22(36)15-30(23)37/h8-9,14-16,25-26,28H,10-13,17-19H2,1-7H3,(H,38,41)/t25-,26+,28-/m0/s1
n/an/a 4.5n/an/an/an/an/an/a
Merck Research Laboratories
Curated by ChEMBL
Assay Description
Displacement of [125I]-NDP-R-MSH from human MC4R expressed in CHO cells after 1.5 hrs by scintillation counting
Bioorg Med Chem Lett 20: 4399-405 (2010)
Article DOI: 10.1016/j.bmcl.2010.06.062
BindingDB Entry DOI: 10.7270/Q23F4Q07
Melanocyte-stimulating hormone receptor
(Homo sapiens (Human))
BDBM50314765
(CHEMBL1093305 | trans-N-(2-((S)-1'-((3S,4R)-1-tert...)
Show SMILES CC(=O)NC(C)(C)[C@H]1CC2(CCN(CC2)C(=O)[C@@H]2CN(C[C@H]2c2ccc(F)cc2F)C(C)(C)C)c2cc(Cl)c(C)cc12 |r|
Show InChI InChI=1S/C34H44ClF2N3O2/c1-20-14-24-27(16-29(20)35)34(17-28(24)33(6,7)38-21(2)41)10-12-39(13-11-34)31(42)26-19-40(32(3,4)5)18-25(26)23-9-8-22(36)15-30(23)37/h8-9,14-16,25-26,28H,10-13,17-19H2,1-7H3,(H,38,41)/t25-,26+,28-/m0/s1
n/an/an/an/a 228n/an/an/an/a
Merck Research Laboratories
Curated by ChEMBL
Assay Description
Agonist activity at human MC1R expressed in CHO cells assessed as stimulation of intracellular cAMP accumulation
Bioorg Med Chem Lett 20: 2106-10 (2010)
Article DOI: 10.1016/j.bmcl.2010.02.058
BindingDB Entry DOI: 10.7270/Q2QC03NP
Melanocortin receptor 4
(Homo sapiens (Human))
BDBM50314765
(CHEMBL1093305 | trans-N-(2-((S)-1'-((3S,4R)-1-tert...)
Show SMILES CC(=O)NC(C)(C)[C@H]1CC2(CCN(CC2)C(=O)[C@@H]2CN(C[C@H]2c2ccc(F)cc2F)C(C)(C)C)c2cc(Cl)c(C)cc12 |r|
Show InChI InChI=1S/C34H44ClF2N3O2/c1-20-14-24-27(16-29(20)35)34(17-28(24)33(6,7)38-21(2)41)10-12-39(13-11-34)31(42)26-19-40(32(3,4)5)18-25(26)23-9-8-22(36)15-30(23)37/h8-9,14-16,25-26,28H,10-13,17-19H2,1-7H3,(H,38,41)/t25-,26+,28-/m0/s1
n/an/a 4.30n/an/an/an/an/an/a
Merck Research Laboratories
Curated by ChEMBL
Assay Description
Displacement of [125I]NDP-alpha-MSH from human MC4R expressed in CHO cells
Bioorg Med Chem Lett 20: 2106-10 (2010)
Article DOI: 10.1016/j.bmcl.2010.02.058
BindingDB Entry DOI: 10.7270/Q2QC03NP