BDBM50314850 1-(4-chloro-3-(trifluoromethyl)phenyl)-3-((2S,3S,5R)-2-(hydroxymethyl)-5-(5-methyl-2,4-dioxo-3,4-dihydropyrimidin-1(2H)-yl)tetrahydrofuran-3-yl)thiourea::CHEMBL1091873
SMILES: Cc1cn([C@H]2C[C@H](NC(=S)Nc3ccc(Cl)c(c3)C(F)(F)F)[C@@H](CO)O2)c(=O)[nH]c1=O
InChI Key: InChIKey=MZDLFVKFDHPYOO-BFHYXJOUSA-N
Data: 1 KI  2 IC50
Activity Spreadsheet -- Enzyme Inhibition Constant Data from BindingDB
Found 3 hits for monomerid = 50314850
Trg + Lig
Ki
nM
ΔG°
kcal/mole
IC50
nM
Kd
nM
EC50/IC50
nM
koff
s-1
kon
M-1s-1
pHTemp
°C
Thymidylate kinase
(Mycobacterium tuberculosis)
BDBM50314850
(1-(4-chloro-3-(trifluoromethyl)phenyl)-3-((2S,3S,5...)
Show SMILES Cc1cn([C@H]2C[C@H](NC(=S)Nc3ccc(Cl)c(c3)C(F)(F)F)[C@@H](CO)O2)c(=O)[nH]c1=O |r|
Show InChI InChI=1S/C18H18ClF3N4O4S/c1-8-6-26(17(29)25-15(8)28)14-5-12(13(7-27)30-14)24-16(31)23-9-2-3-11(19)10(4-9)18(20,21)22/h2-4,6,12-14,27H,5,7H2,1H3,(H2,23,24,31)(H,25,28,29)/t12-,13+,14+/m0/s1
9.90E+3n/an/an/an/an/an/an/an/a
Ghent University
Curated by ChEMBL
Assay Description
Competitive inhibition of Mycobacterium tuberculosis TMPK by Lineweaver-Burk analysis
Bioorg Med Chem 19: 7603-11 (2011)
Article DOI: 10.1016/j.bmc.2011.10.021
BindingDB Entry DOI: 10.7270/Q2JH3MMD
Thymidine kinase, cytosolic
(Homo sapiens (Human))
BDBM50314850
(1-(4-chloro-3-(trifluoromethyl)phenyl)-3-((2S,3S,5...)
Show SMILES Cc1cn([C@H]2C[C@H](NC(=S)Nc3ccc(Cl)c(c3)C(F)(F)F)[C@@H](CO)O2)c(=O)[nH]c1=O |r|
Show InChI InChI=1S/C18H18ClF3N4O4S/c1-8-6-26(17(29)25-15(8)28)14-5-12(13(7-27)30-14)24-16(31)23-9-2-3-11(19)10(4-9)18(20,21)22/h2-4,6,12-14,27H,5,7H2,1H3,(H2,23,24,31)(H,25,28,29)/t12-,13+,14+/m0/s1
NCI pathway
Reactome pathway
n/an/a 3.16E+5n/an/an/an/an/an/a
Ghent University
Curated by ChEMBL
Assay Description
Inhibition of human recombinant cytosolic thymidine kinase 1 assessed as inhibition of [methyl-3H]dThd phosphorylation after 30 mins by scintillation...
J Med Chem 53: 2902-12 (2010)
Article DOI: 10.1021/jm901532h
BindingDB Entry DOI: 10.7270/Q26D5T47
Thymidine kinase, mitochondrial
(Homo sapiens (Human))
BDBM50314850
(1-(4-chloro-3-(trifluoromethyl)phenyl)-3-((2S,3S,5...)
Show SMILES Cc1cn([C@H]2C[C@H](NC(=S)Nc3ccc(Cl)c(c3)C(F)(F)F)[C@@H](CO)O2)c(=O)[nH]c1=O |r|
Show InChI InChI=1S/C18H18ClF3N4O4S/c1-8-6-26(17(29)25-15(8)28)14-5-12(13(7-27)30-14)24-16(31)23-9-2-3-11(19)10(4-9)18(20,21)22/h2-4,6,12-14,27H,5,7H2,1H3,(H2,23,24,31)(H,25,28,29)/t12-,13+,14+/m0/s1
Reactome pathway
n/an/a 150n/an/an/an/an/an/a
Ghent University
Curated by ChEMBL
Assay Description
Inhibition of human recombinant mitochondrial thymidine kinase 2 assessed as inhibition of [methyl-3H]dThd phosphorylation after 30 mins by scintilla...
J Med Chem 53: 2902-12 (2010)
Article DOI: 10.1021/jm901532h
BindingDB Entry DOI: 10.7270/Q26D5T47