BDBM50314888 1'-(3,7-dimethyl-1H-indazole-5-carbonyl)-5-methoxyspiro[chroman-2,4'-piperidin]-4-one::CHEMBL1092308
SMILES: COc1cccc2OC3(CCN(CC3)C(=O)c3cc(C)c4[nH]nc(C)c4c3)CC(=O)c12
InChI Key: InChIKey=SFQNJYPSTQRBCJ-UHFFFAOYSA-N
Data: 2 IC50
Activity Spreadsheet -- Enzyme Inhibition Constant Data from BindingDB
Found 2 hits for monomerid = 50314888
Trg + Lig
Ki
nM
ΔG°
kcal/mole
IC50
nM
Kd
nM
EC50/IC50
nM
koff
s-1
kon
M-1s-1
pHTemp
°C
Acetyl-CoA carboxylase 2 (ACC2)
(Homo sapiens (Human))
BDBM50314888
(1'-(3,7-dimethyl-1H-indazole-5-carbonyl)-5-methoxy...)
Show SMILES COc1cccc2OC3(CCN(CC3)C(=O)c3cc(C)c4[nH]nc(C)c4c3)CC(=O)c12
Show InChI InChI=1S/C24H25N3O4/c1-14-11-16(12-17-15(2)25-26-22(14)17)23(29)27-9-7-24(8-10-27)13-18(28)21-19(30-3)5-4-6-20(21)31-24/h4-6,11-12H,7-10,13H2,1-3H3,(H,25,26)
Reactome pathway
n/an/a 11n/an/an/an/an/an/a
Pfizer Global Research and Development
Curated by ChEMBL
Assay Description
Inhibition of human recombinant ACC2 expressed in CHO cells after 1 hr by fluorescence reader
Bioorg Med Chem Lett 20: 2383-8 (2010)
Article DOI: 10.1016/j.bmcl.2009.04.091
BindingDB Entry DOI: 10.7270/Q22N52DW
Acetyl-CoA carboxylase 1 (ACC1)
(Rattus norvegicus (Rat))
BDBM50314888
(1'-(3,7-dimethyl-1H-indazole-5-carbonyl)-5-methoxy...)
Show SMILES COc1cccc2OC3(CCN(CC3)C(=O)c3cc(C)c4[nH]nc(C)c4c3)CC(=O)c12
Show InChI InChI=1S/C24H25N3O4/c1-14-11-16(12-17-15(2)25-26-22(14)17)23(29)27-9-7-24(8-10-27)13-18(28)21-19(30-3)5-4-6-20(21)31-24/h4-6,11-12H,7-10,13H2,1-3H3,(H,25,26)
n/an/a 42n/an/an/an/an/an/a
Pfizer Global Research and Development
Curated by ChEMBL
Assay Description
Inhibition of rat liver ACC1 after 7 mins by liquid scintillation counter
Bioorg Med Chem Lett 20: 2383-8 (2010)
Article DOI: 10.1016/j.bmcl.2009.04.091
BindingDB Entry DOI: 10.7270/Q22N52DW